BDBM50232435 CHEMBL4070480
SMILES: CC(=O)N1CCN(CC1c1ccccc1)c1cccc(c1)-c1cc(-c2ccnn2C2CCOCC2)c2c(N)ncnn12
InChI Key: InChIKey=ZSAGXWMRDJNQTG-UHFFFAOYSA-N
Data: 1 IC50
Activity Spreadsheet -- Enzyme Inhibition Constant Data from BindingDB
Found 1 hit for monomerid = 50232435
Trg + Lig
Ki
nM
ΔG°
kcal/mole
IC50
nM
Kd
nM
EC50/IC50
nM
koff
s-1
kon
M-1s-1
pHTemp
°C
Phosphatidylinositol 4,5-bisphosphate 3-kinase catalytic subunit delta isoform
(Homo sapiens (Human))
BDBM50232435
(CHEMBL4070480)
Show SMILES CC(=O)N1CCN(CC1c1ccccc1)c1cccc(c1)-c1cc(-c2ccnn2C2CCOCC2)c2c(N)ncnn12
Show InChI InChI=1S/C32H34N8O2/c1-22(41)38-15-14-37(20-30(38)23-6-3-2-4-7-23)26-9-5-8-24(18-26)29-19-27(31-32(33)34-21-36-40(29)31)28-10-13-35-39(28)25-11-16-42-17-12-25/h2-10,13,18-19,21,25,30H,11-12,14-17,20H2,1H3,(H2,33,34,36)
NCI pathway
Reactome pathway
n/an/a 4.30n/an/an/an/an/an/a
Bristol-Myers Squibb
Curated by ChEMBL
Assay Description
Inhibition of PI3Kdelta (unknown origin) using PIP2:PS as substrate incubated for 3 hrs by ADP-Glo assay
Bioorg Med Chem Lett 27: 855-861 (2017)
BindingDB Entry DOI: 10.7270/Q2BR8VFH