null
SMILES: CC(=O)N1CCN(CC1)c1cccc(c1)-c1cc(-c2ccnn2CC(F)(F)F)c2c(N)ncnn12
InChI Key: InChIKey=NHTBEIFBWSUCGT-UHFFFAOYSA-N
Activity Spreadsheet -- Enzyme Inhibition Constant Data from BindingDB
Found 3 hits for monomerid = 50232441
Trg + Lig
Ki
nM
ΔG°
kcal/mole
IC50
nM
Kd
nM
EC50/IC50
nM
koff
s-1
kon
M-1s-1
pHTemp
°C
Phosphatidylinositol 4,5-bisphosphate 3-kinase catalytic subunit delta isoform
(Homo sapiens (Human))
BDBM50232441
(CHEMBL4101075 | US10214537, Example 535)
Show SMILES CC(=O)N1CCN(CC1)c1cccc(c1)-c1cc(-c2ccnn2CC(F)(F)F)c2c(N)ncnn12
Show InChI InChI=1S/C23H23F3N8O/c1-15(35)31-7-9-32(10-8-31)17-4-2-3-16(11-17)20-12-18(21-22(27)28-14-30-34(20)21)19-5-6-29-33(19)13-23(24,25)26/h2-6,11-12,14H,7-10,13H2,1H3,(H2,27,28,30)
NCI pathway
Reactome pathway
n/an/a 5.5n/an/an/an/an/an/a
Bristol-Myers Squibb
Curated by ChEMBL
Assay Description
Inhibition of PI3Kdelta (unknown origin) using PIP2:PS as substrate incubated for 3 hrs by ADP-Glo assay
Bioorg Med Chem Lett 27: 855-861 (2017)
BindingDB Entry DOI: 10.7270/Q2BR8VFH
Phosphatidylinositol 4,5-bisphosphate 3-kinase catalytic subunit delta isoform
(Homo sapiens (Human))
BDBM50232441
(CHEMBL4101075 | US10214537, Example 535)
Show SMILES CC(=O)N1CCN(CC1)c1cccc(c1)-c1cc(-c2ccnn2CC(F)(F)F)c2c(N)ncnn12
Show InChI InChI=1S/C23H23F3N8O/c1-15(35)31-7-9-32(10-8-31)17-4-2-3-16(11-17)20-12-18(21-22(27)28-14-30-34(20)21)19-5-6-29-33(19)13-23(24,25)26/h2-6,11-12,14H,7-10,13H2,1H3,(H2,27,28,30)
NCI pathway
Reactome pathway
US Patent
n/an/a 6n/an/an/an/an/an/a
Bristol-Myers Squibb Company
US Patent
Assay Description
The ADP-Glo format PI3K assays were performed in Proxiplate 384-well plates (Perkin Elmer #6008280). The final assay volume was 2 μl prepared fr...
US Patent US10214537 (2019)
BindingDB Entry DOI: 10.7270/Q2HH6NB2
Phosphatidylinositol 4,5-bisphosphate 3-kinase catalytic subunit delta isoform
(Homo sapiens (Human))
BDBM50232441
(CHEMBL4101075 | US10214537, Example 535)
Show SMILES CC(=O)N1CCN(CC1)c1cccc(c1)-c1cc(-c2ccnn2CC(F)(F)F)c2c(N)ncnn12
Show InChI InChI=1S/C23H23F3N8O/c1-15(35)31-7-9-32(10-8-31)17-4-2-3-16(11-17)20-12-18(21-22(27)28-14-30-34(20)21)19-5-6-29-33(19)13-23(24,25)26/h2-6,11-12,14H,7-10,13H2,1H3,(H2,27,28,30)
NCI pathway
Reactome pathway
n/an/a 143n/an/an/an/an/an/a
Bristol-Myers Squibb
Curated by ChEMBL
Assay Description
Inhibition of PI3Kdelta in human whole blood assessed as suppression of CD69 expression incubated for 60 mins
Bioorg Med Chem Lett 27: 855-861 (2017)
BindingDB Entry DOI: 10.7270/Q2BR8VFH