BDBM50232510 (2R)-4-[8-benzyl-3-(trifluoromethyl)-5,6-dihydro[1,2,4]triazolo[4,3-a]pyrazin-7(8H)-yl]-4-oxo-1-(2,4,5-trifluorophenyl)butan-2-amine hydrochloride::CHEMBL539350
SMILES: N[C@@H](CC(=O)N1CCn2c(nnc2C(F)(F)F)C1Cc1ccccc1)Cc1cc(F)c(F)cc1F
InChI Key: InChIKey=QTVNDHFXVZVLIP-NYRJJRHWSA-N
Data: 14 IC50
Activity Spreadsheet -- Enzyme Inhibition Constant Data from BindingDB
Found 14 hits for monomerid = 50232510
Trg + Lig
Ki
nM
ΔG°
kcal/mole
IC50
nM
Kd
nM
EC50/IC50
nM
koff
s-1
kon
M-1s-1
pHTemp
°C
Dipeptidyl peptidase VIII
(Homo sapiens (Human))
BDBM50232510
((2R)-4-[8-benzyl-3-(trifluoromethyl)-5,6-dihydro[1...)
Show SMILES N[C@@H](CC(=O)N1CCn2c(nnc2C(F)(F)F)C1Cc1ccccc1)Cc1cc(F)c(F)cc1F |w:17.19|
Show InChI InChI=1S/C23H21F6N5O/c24-16-12-18(26)17(25)10-14(16)9-15(30)11-20(35)33-6-7-34-21(31-32-22(34)23(27,28)29)19(33)8-13-4-2-1-3-5-13/h1-5,10,12,15,19H,6-9,11,30H2/t15-,19?/m1/s1
n/an/a>1.00E+5n/an/an/an/an/an/a
Merck Research Laboratories
Curated by ChEMBL
Assay Description
Inhibition of DPP8
J Med Chem 51: 589-602 (2008)
Article DOI: 10.1021/jm070330v
BindingDB Entry DOI: 10.7270/Q2B27W4M
Xaa-Pro aminopeptidase 1
(Homo sapiens (Human))
BDBM50232510
((2R)-4-[8-benzyl-3-(trifluoromethyl)-5,6-dihydro[1...)
Show SMILES N[C@@H](CC(=O)N1CCn2c(nnc2C(F)(F)F)C1Cc1ccccc1)Cc1cc(F)c(F)cc1F |w:17.19|
Show InChI InChI=1S/C23H21F6N5O/c24-16-12-18(26)17(25)10-14(16)9-15(30)11-20(35)33-6-7-34-21(31-32-22(34)23(27,28)29)19(33)8-13-4-2-1-3-5-13/h1-5,10,12,15,19H,6-9,11,30H2/t15-,19?/m1/s1
n/an/a>1.00E+4n/an/an/an/an/an/a
Merck Research Laboratories
Curated by ChEMBL
Assay Description
Inhibition of amino peptidase P
J Med Chem 51: 589-602 (2008)
Article DOI: 10.1021/jm070330v
BindingDB Entry DOI: 10.7270/Q2B27W4M
Dipeptidyl peptidase 4
(Homo sapiens (Human))
BDBM50232510
((2R)-4-[8-benzyl-3-(trifluoromethyl)-5,6-dihydro[1...)
Show SMILES N[C@@H](CC(=O)N1CCn2c(nnc2C(F)(F)F)C1Cc1ccccc1)Cc1cc(F)c(F)cc1F |w:17.19|
Show InChI InChI=1S/C23H21F6N5O/c24-16-12-18(26)17(25)10-14(16)9-15(30)11-20(35)33-6-7-34-21(31-32-22(34)23(27,28)29)19(33)8-13-4-2-1-3-5-13/h1-5,10,12,15,19H,6-9,11,30H2/t15-,19?/m1/s1
Reactome pathway
n/an/a 0.660n/an/an/an/an/an/a
Merck Research Laboratories
Curated by ChEMBL
Assay Description
Inhibition of DPP4
J Med Chem 51: 589-602 (2008)
Article DOI: 10.1021/jm070330v
BindingDB Entry DOI: 10.7270/Q2B27W4M
Xaa-Pro dipeptidase
(Homo sapiens (Human))
BDBM50232510
((2R)-4-[8-benzyl-3-(trifluoromethyl)-5,6-dihydro[1...)
Show SMILES N[C@@H](CC(=O)N1CCn2c(nnc2C(F)(F)F)C1Cc1ccccc1)Cc1cc(F)c(F)cc1F |w:17.19|
Show InChI InChI=1S/C23H21F6N5O/c24-16-12-18(26)17(25)10-14(16)9-15(30)11-20(35)33-6-7-34-21(31-32-22(34)23(27,28)29)19(33)8-13-4-2-1-3-5-13/h1-5,10,12,15,19H,6-9,11,30H2/t15-,19?/m1/s1
n/an/a>1.00E+4n/an/an/an/an/an/a
Merck Research Laboratories
Curated by ChEMBL
Assay Description
Inhibition of prolidase
J Med Chem 51: 589-602 (2008)
Article DOI: 10.1021/jm070330v
BindingDB Entry DOI: 10.7270/Q2B27W4M
Dipeptidyl peptidase 2 (DPP II)
(Homo sapiens (Human))
BDBM50232510
((2R)-4-[8-benzyl-3-(trifluoromethyl)-5,6-dihydro[1...)
Show SMILES N[C@@H](CC(=O)N1CCn2c(nnc2C(F)(F)F)C1Cc1ccccc1)Cc1cc(F)c(F)cc1F |w:17.19|
Show InChI InChI=1S/C23H21F6N5O/c24-16-12-18(26)17(25)10-14(16)9-15(30)11-20(35)33-6-7-34-21(31-32-22(34)23(27,28)29)19(33)8-13-4-2-1-3-5-13/h1-5,10,12,15,19H,6-9,11,30H2/t15-,19?/m1/s1
n/an/a 5.20E+4n/an/an/an/an/an/a
Merck Research Laboratories
Curated by ChEMBL
Assay Description
Inhibition of QPP
J Med Chem 51: 589-602 (2008)
Article DOI: 10.1021/jm070330v
BindingDB Entry DOI: 10.7270/Q2B27W4M
Fibroblast activation protein alpha
(Homo sapiens (Human))
BDBM50232510
((2R)-4-[8-benzyl-3-(trifluoromethyl)-5,6-dihydro[1...)
Show SMILES N[C@@H](CC(=O)N1CCn2c(nnc2C(F)(F)F)C1Cc1ccccc1)Cc1cc(F)c(F)cc1F |w:17.19|
Show InChI InChI=1S/C23H21F6N5O/c24-16-12-18(26)17(25)10-14(16)9-15(30)11-20(35)33-6-7-34-21(31-32-22(34)23(27,28)29)19(33)8-13-4-2-1-3-5-13/h1-5,10,12,15,19H,6-9,11,30H2/t15-,19?/m1/s1
n/an/a>1.00E+4n/an/an/an/an/an/a
Merck Research Laboratories
Curated by ChEMBL
Assay Description
Inhibition of FAP
J Med Chem 51: 589-602 (2008)
Article DOI: 10.1021/jm070330v
BindingDB Entry DOI: 10.7270/Q2B27W4M
Dipeptidyl peptidase 9
(Homo sapiens (Human))
BDBM50232510
((2R)-4-[8-benzyl-3-(trifluoromethyl)-5,6-dihydro[1...)
Show SMILES N[C@@H](CC(=O)N1CCn2c(nnc2C(F)(F)F)C1Cc1ccccc1)Cc1cc(F)c(F)cc1F |w:17.19|
Show InChI InChI=1S/C23H21F6N5O/c24-16-12-18(26)17(25)10-14(16)9-15(30)11-20(35)33-6-7-34-21(31-32-22(34)23(27,28)29)19(33)8-13-4-2-1-3-5-13/h1-5,10,12,15,19H,6-9,11,30H2/t15-,19?/m1/s1
n/an/a>1.00E+5n/an/an/an/an/an/a
Merck Research Laboratories
Curated by ChEMBL
Assay Description
Inhibition of DPP9
J Med Chem 51: 589-602 (2008)
Article DOI: 10.1021/jm070330v
BindingDB Entry DOI: 10.7270/Q2B27W4M
Dipeptidyl peptidase 9
(Homo sapiens (Human))
BDBM50232510
((2R)-4-[8-benzyl-3-(trifluoromethyl)-5,6-dihydro[1...)
Show SMILES N[C@@H](CC(=O)N1CCn2c(nnc2C(F)(F)F)C1Cc1ccccc1)Cc1cc(F)c(F)cc1F |w:17.19|
Show InChI InChI=1S/C23H21F6N5O/c24-16-12-18(26)17(25)10-14(16)9-15(30)11-20(35)33-6-7-34-21(31-32-22(34)23(27,28)29)19(33)8-13-4-2-1-3-5-13/h1-5,10,12,15,19H,6-9,11,30H2/t15-,19?/m1/s1
n/an/a 2.40E+4n/an/an/an/an/an/a
Merck Research Laboratories
Curated by ChEMBL
Assay Description
Inhibition of DPP9
J Med Chem 51: 589-602 (2008)
Article DOI: 10.1021/jm070330v
BindingDB Entry DOI: 10.7270/Q2B27W4M
Xaa-Pro dipeptidase
(Homo sapiens (Human))
BDBM50232510
((2R)-4-[8-benzyl-3-(trifluoromethyl)-5,6-dihydro[1...)
Show SMILES N[C@@H](CC(=O)N1CCn2c(nnc2C(F)(F)F)C1Cc1ccccc1)Cc1cc(F)c(F)cc1F |w:17.19|
Show InChI InChI=1S/C23H21F6N5O/c24-16-12-18(26)17(25)10-14(16)9-15(30)11-20(35)33-6-7-34-21(31-32-22(34)23(27,28)29)19(33)8-13-4-2-1-3-5-13/h1-5,10,12,15,19H,6-9,11,30H2/t15-,19?/m1/s1
n/an/a>1.00E+4n/an/an/an/an/an/a
Merck Research Laboratories
Curated by ChEMBL
Assay Description
Inhibition of prolidase
J Med Chem 51: 589-602 (2008)
Article DOI: 10.1021/jm070330v
BindingDB Entry DOI: 10.7270/Q2B27W4M
Xaa-Pro aminopeptidase 1
(Homo sapiens (Human))
BDBM50232510
((2R)-4-[8-benzyl-3-(trifluoromethyl)-5,6-dihydro[1...)
Show SMILES N[C@@H](CC(=O)N1CCn2c(nnc2C(F)(F)F)C1Cc1ccccc1)Cc1cc(F)c(F)cc1F |w:17.19|
Show InChI InChI=1S/C23H21F6N5O/c24-16-12-18(26)17(25)10-14(16)9-15(30)11-20(35)33-6-7-34-21(31-32-22(34)23(27,28)29)19(33)8-13-4-2-1-3-5-13/h1-5,10,12,15,19H,6-9,11,30H2/t15-,19?/m1/s1
n/an/a>1.00E+4n/an/an/an/an/an/a
Merck Research Laboratories
Curated by ChEMBL
Assay Description
Inhibition of amino peptidase P
J Med Chem 51: 589-602 (2008)
Article DOI: 10.1021/jm070330v
BindingDB Entry DOI: 10.7270/Q2B27W4M
Dipeptidyl peptidase VIII
(Homo sapiens (Human))
BDBM50232510
((2R)-4-[8-benzyl-3-(trifluoromethyl)-5,6-dihydro[1...)
Show SMILES N[C@@H](CC(=O)N1CCn2c(nnc2C(F)(F)F)C1Cc1ccccc1)Cc1cc(F)c(F)cc1F |w:17.19|
Show InChI InChI=1S/C23H21F6N5O/c24-16-12-18(26)17(25)10-14(16)9-15(30)11-20(35)33-6-7-34-21(31-32-22(34)23(27,28)29)19(33)8-13-4-2-1-3-5-13/h1-5,10,12,15,19H,6-9,11,30H2/t15-,19?/m1/s1
n/an/a 622n/an/an/an/an/an/a
Merck Research Laboratories
Curated by ChEMBL
Assay Description
Inhibition of DPP8
J Med Chem 51: 589-602 (2008)
Article DOI: 10.1021/jm070330v
BindingDB Entry DOI: 10.7270/Q2B27W4M
Fibroblast activation protein alpha
(Homo sapiens (Human))
BDBM50232510
((2R)-4-[8-benzyl-3-(trifluoromethyl)-5,6-dihydro[1...)
Show SMILES N[C@@H](CC(=O)N1CCn2c(nnc2C(F)(F)F)C1Cc1ccccc1)Cc1cc(F)c(F)cc1F |w:17.19|
Show InChI InChI=1S/C23H21F6N5O/c24-16-12-18(26)17(25)10-14(16)9-15(30)11-20(35)33-6-7-34-21(31-32-22(34)23(27,28)29)19(33)8-13-4-2-1-3-5-13/h1-5,10,12,15,19H,6-9,11,30H2/t15-,19?/m1/s1
n/an/a>1.00E+4n/an/an/an/an/an/a
Merck Research Laboratories
Curated by ChEMBL
Assay Description
Inhibition of FAP
J Med Chem 51: 589-602 (2008)
Article DOI: 10.1021/jm070330v
BindingDB Entry DOI: 10.7270/Q2B27W4M
Dipeptidyl peptidase 4
(Homo sapiens (Human))
BDBM50232510
((2R)-4-[8-benzyl-3-(trifluoromethyl)-5,6-dihydro[1...)
Show SMILES N[C@@H](CC(=O)N1CCn2c(nnc2C(F)(F)F)C1Cc1ccccc1)Cc1cc(F)c(F)cc1F |w:17.19|
Show InChI InChI=1S/C23H21F6N5O/c24-16-12-18(26)17(25)10-14(16)9-15(30)11-20(35)33-6-7-34-21(31-32-22(34)23(27,28)29)19(33)8-13-4-2-1-3-5-13/h1-5,10,12,15,19H,6-9,11,30H2/t15-,19?/m1/s1
Reactome pathway
n/an/a 140n/an/an/an/an/an/a
Merck Research Laboratories
Curated by ChEMBL
Assay Description
Inhibition of DPP4
J Med Chem 51: 589-602 (2008)
Article DOI: 10.1021/jm070330v
BindingDB Entry DOI: 10.7270/Q2B27W4M
Dipeptidyl peptidase 2 (DPP II)
(Homo sapiens (Human))
BDBM50232510
((2R)-4-[8-benzyl-3-(trifluoromethyl)-5,6-dihydro[1...)
Show SMILES N[C@@H](CC(=O)N1CCn2c(nnc2C(F)(F)F)C1Cc1ccccc1)Cc1cc(F)c(F)cc1F |w:17.19|
Show InChI InChI=1S/C23H21F6N5O/c24-16-12-18(26)17(25)10-14(16)9-15(30)11-20(35)33-6-7-34-21(31-32-22(34)23(27,28)29)19(33)8-13-4-2-1-3-5-13/h1-5,10,12,15,19H,6-9,11,30H2/t15-,19?/m1/s1
n/an/a 8.70E+4n/an/an/an/an/an/a
Merck Research Laboratories
Curated by ChEMBL
Assay Description
Inhibition of QPP
J Med Chem 51: 589-602 (2008)
Article DOI: 10.1021/jm070330v
BindingDB Entry DOI: 10.7270/Q2B27W4M