null
SMILES: CC[C@H]1N(C(C)C)c2nc(Nc3cc(F)c(cc3OC)C(=O)NC3CCN(C)CC3)ncc2-n2cnc(C#N)c12
InChI Key: InChIKey=UMYZHTXQBNEZNF-JOCHJYFZSA-N
Activity Spreadsheet -- Enzyme Inhibition Constant Data from BindingDB
Found 1 hit for monomerid = 50232579
Trg + Lig
Ki
nM
ΔG°
kcal/mole
IC50
nM
Kd
nM
EC50/IC50
nM
koff
s-1
kon
M-1s-1
pHTemp
°C
Serine/threonine-protein kinase PLK1
(Homo sapiens (Human))
BDBM50232579
(CHEMBL4103908)
Show SMILES CC[C@H]1N(C(C)C)c2nc(Nc3cc(F)c(cc3OC)C(=O)NC3CCN(C)CC3)ncc2-n2cnc(C#N)c12 |r|
Show InChI InChI=1S/C28H34FN9O2/c1-6-22-25-21(13-30)32-15-37(25)23-14-31-28(35-26(23)38(22)16(2)3)34-20-12-19(29)18(11-24(20)40-5)27(39)33-17-7-9-36(4)10-8-17/h11-12,14-17,22H,6-10H2,1-5H3,(H,33,39)(H,31,34,35)/t22-/m1/s1
NCI pathway
Reactome pathway
n/an/a 1.90n/an/an/an/an/an/a
Takeda California
Curated by ChEMBL
Assay Description
Inhibition of human FLAG-tagged PLK1 expressed in baculovirus infected sf21 cells using Biotin-AGAGTVPESIHSFIGDGLV as substrate by TR-FRET assay
Bioorg Med Chem Lett 27: 1311-1315 (2017)
BindingDB Entry DOI: 10.7270/Q2K939RQ