BDBM50232585 CHEMBL4063398
SMILES: CC[C@H]1N(C2CCCC2)c2nc(Nc3ccc(cc3OC)C(=O)NC3CCN(C)CC3)ncc2-n2cnc(C(N)=O)c12
InChI Key: InChIKey=AWYSFWYRQPHWJL-JOCHJYFZSA-N
Data: 1 IC50
Activity Spreadsheet -- Enzyme Inhibition Constant Data from BindingDB
Found 1 hit for monomerid = 50232585
Trg + Lig
Ki
nM
ΔG°
kcal/mole
IC50
nM
Kd
nM
EC50/IC50
nM
koff
s-1
kon
M-1s-1
pHTemp
°C
Serine/threonine-protein kinase PLK1
(Homo sapiens (Human))
BDBM50232585
(CHEMBL4063398)
Show SMILES CC[C@H]1N(C2CCCC2)c2nc(Nc3ccc(cc3OC)C(=O)NC3CCN(C)CC3)ncc2-n2cnc(C(N)=O)c12 |r|
Show InChI InChI=1S/C30H39N9O3/c1-4-22-26-25(27(31)40)33-17-38(26)23-16-32-30(36-28(23)39(22)20-7-5-6-8-20)35-21-10-9-18(15-24(21)42-3)29(41)34-19-11-13-37(2)14-12-19/h9-10,15-17,19-20,22H,4-8,11-14H2,1-3H3,(H2,31,40)(H,34,41)(H,32,35,36)/t22-/m1/s1
NCI pathway
Reactome pathway
n/an/a 2n/an/an/an/an/an/a
Takeda California
Curated by ChEMBL
Assay Description
Inhibition of human FLAG-tagged PLK1 expressed in baculovirus infected sf21 cells using Biotin-AGAGTVPESIHSFIGDGLV as substrate by TR-FRET assay
Bioorg Med Chem Lett 27: 1311-1315 (2017)
BindingDB Entry DOI: 10.7270/Q2K939RQ