null
SMILES: Nc1ccccc1NC(=O)c1ccc(CSc2nnc(o2)-c2ccccc2)cc1
InChI Key: InChIKey=SSFZJBIZFATNHN-UHFFFAOYSA-N
Activity Spreadsheet -- Enzyme Inhibition Constant Data from BindingDB
Found 1 hit for monomerid = 50232660
Trg + Lig
Ki
nM
ΔG°
kcal/mole
IC50
nM
Kd
nM
EC50/IC50
nM
koff
s-1
kon
M-1s-1
pHTemp
°C
Histone deacetylase 1
(Homo sapiens (Human))
BDBM50232660
(CHEMBL402599 | N-(2-aminophenyl)-4-((5-phenyl-1,3,...)
Show SMILES Nc1ccccc1NC(=O)c1ccc(CSc2nnc(o2)-c2ccccc2)cc1
Show InChI InChI=1S/C22H18N4O2S/c23-18-8-4-5-9-19(18)24-20(27)16-12-10-15(11-13-16)14-29-22-26-25-21(28-22)17-6-2-1-3-7-17/h1-13H,14,23H2,(H,24,27)
NCI pathway
Reactome pathway
n/an/a 80n/an/an/an/an/an/a
MethylGene Inc.
Curated by ChEMBL
Assay Description
Inhibition of recombinant HDAC1
Bioorg Med Chem Lett 18: 1502-6 (2008)
Article DOI: 10.1016/j.bmcl.2007.12.057
BindingDB Entry DOI: 10.7270/Q2416WT0