BDBM50232890 CHEMBL4102677
SMILES: [H][C@]12C[C@@]3([H])C4=CCO[C@@]5([H])\C(=N/OC)C(=O)N6c7ccccc7[C@@]1(CCN2C4)[C@]6([H])[C@@]35[H]
InChI Key: InChIKey=JIEFHNBYMOMHOJ-IBESPKCESA-N
Data: 1 KI  6 IC50
Activity Spreadsheet -- Enzyme Inhibition Constant Data from BindingDB
Found 7 hits for monomerid = 50232890
Trg + Lig
Ki
nM
ΔG°
kcal/mole
IC50
nM
Kd
nM
EC50/IC50
nM
koff
s-1
kon
M-1s-1
pHTemp
°C
Glycine receptor subunit alpha-1
(Homo sapiens (Human))
BDBM50232890
(CHEMBL4102677)
Show SMILES [H][C@]12C[C@@]3([H])C4=CCO[C@@]5([H])\C(=N/OC)C(=O)N6c7ccccc7[C@@]1(CCN2C4)[C@]6([H])[C@@]35[H] |r,c:5|
Show InChI InChI=1S/C22H23N3O3/c1-27-23-18-19-17-13-10-16-22(7-8-24(16)11-12(13)6-9-28-19)14-4-2-3-5-15(14)25(20(17)22)21(18)26/h2-6,13,16-17,19-20H,7-11H2,1H3/b23-18+/t13-,16-,17-,19+,20-,22+/m0/s1
189n/an/an/an/an/an/an/an/a
The German University in Cairo
Curated by ChEMBL
Assay Description
Displacement of [3H]strychnine from recombinant human glycine receptor alpha 1 expressed in HEK293 cell membranes after 30 mins by liquid scintillati...
J Nat Prod 79: 2997-3005 (2016)
BindingDB Entry DOI: 10.7270/Q2QZ2D66
Glycine receptor subunit alpha-1
(Homo sapiens (Human))
BDBM50232890
(CHEMBL4102677)
Show SMILES [H][C@]12C[C@@]3([H])C4=CCO[C@@]5([H])\C(=N/OC)C(=O)N6c7ccccc7[C@@]1(CCN2C4)[C@]6([H])[C@@]35[H] |r,c:5|
Show InChI InChI=1S/C22H23N3O3/c1-27-23-18-19-17-13-10-16-22(7-8-24(16)11-12(13)6-9-28-19)14-4-2-3-5-15(14)25(20(17)22)21(18)26/h2-6,13,16-17,19-20H,7-11H2,1H3/b23-18+/t13-,16-,17-,19+,20-,22+/m0/s1
n/an/a 105n/an/an/an/an/an/a
The German University in Cairo
Curated by ChEMBL
Assay Description
Antagonist activity at recombinant human glycine receptor alpha 1 expressed in human tsA201 cells assessed as inhibition of glycine-induced receptor ...
J Nat Prod 79: 2997-3005 (2016)
BindingDB Entry DOI: 10.7270/Q2QZ2D66
Glycine receptor subunit alpha-1
(Homo sapiens (Human))
BDBM50232890
(CHEMBL4102677)
Show SMILES [H][C@]12C[C@@]3([H])C4=CCO[C@@]5([H])\C(=N/OC)C(=O)N6c7ccccc7[C@@]1(CCN2C4)[C@]6([H])[C@@]35[H] |r,c:5|
Show InChI InChI=1S/C22H23N3O3/c1-27-23-18-19-17-13-10-16-22(7-8-24(16)11-12(13)6-9-28-19)14-4-2-3-5-15(14)25(20(17)22)21(18)26/h2-6,13,16-17,19-20H,7-11H2,1H3/b23-18+/t13-,16-,17-,19+,20-,22+/m0/s1
n/an/a 75n/an/an/an/an/an/a
The German University in Cairo
Curated by ChEMBL
Assay Description
Antagonist activity at recombinant human glycine receptor alpha 1 expressed in HEK293 cells assessed as inhibition of glycine-induced current at -50 ...
J Nat Prod 79: 2997-3005 (2016)
BindingDB Entry DOI: 10.7270/Q2QZ2D66
Glycine receptor (alpha-1/beta)
(Homo sapiens (Human))
BDBM50232890
(CHEMBL4102677)
Show SMILES [H][C@]12C[C@@]3([H])C4=CCO[C@@]5([H])\C(=N/OC)C(=O)N6c7ccccc7[C@@]1(CCN2C4)[C@]6([H])[C@@]35[H] |r,c:5|
Show InChI InChI=1S/C22H23N3O3/c1-27-23-18-19-17-13-10-16-22(7-8-24(16)11-12(13)6-9-28-19)14-4-2-3-5-15(14)25(20(17)22)21(18)26/h2-6,13,16-17,19-20H,7-11H2,1H3/b23-18+/t13-,16-,17-,19+,20-,22+/m0/s1
n/an/a 56n/an/an/an/an/an/a
The German University in Cairo
Curated by ChEMBL
Assay Description
Antagonist activity at recombinant human glycine receptor alpha 1 beta expressed in HEK293 cells assessed as inhibition of glycine-induced current at...
J Nat Prod 79: 2997-3005 (2016)
BindingDB Entry DOI: 10.7270/Q2QZ2D66
Glycine receptor (alpha-1/beta)
(Homo sapiens (Human))
BDBM50232890
(CHEMBL4102677)
Show SMILES [H][C@]12C[C@@]3([H])C4=CCO[C@@]5([H])\C(=N/OC)C(=O)N6c7ccccc7[C@@]1(CCN2C4)[C@]6([H])[C@@]35[H] |r,c:5|
Show InChI InChI=1S/C22H23N3O3/c1-27-23-18-19-17-13-10-16-22(7-8-24(16)11-12(13)6-9-28-19)14-4-2-3-5-15(14)25(20(17)22)21(18)26/h2-6,13,16-17,19-20H,7-11H2,1H3/b23-18+/t13-,16-,17-,19+,20-,22+/m0/s1
n/an/a 210n/an/an/an/an/an/a
The German University in Cairo
Curated by ChEMBL
Assay Description
Antagonist activity at recombinant human glycine receptor alpha 1 beta expressed in human tsA201 cells assessed as inhibition of glycine-induced rece...
J Nat Prod 79: 2997-3005 (2016)
BindingDB Entry DOI: 10.7270/Q2QZ2D66
Glycine receptor subunit alpha-1
(Homo sapiens (Human))
BDBM50232890
(CHEMBL4102677)
Show SMILES [H][C@]12C[C@@]3([H])C4=CCO[C@@]5([H])\C(=N/OC)C(=O)N6c7ccccc7[C@@]1(CCN2C4)[C@]6([H])[C@@]35[H] |r,c:5|
Show InChI InChI=1S/C22H23N3O3/c1-27-23-18-19-17-13-10-16-22(7-8-24(16)11-12(13)6-9-28-19)14-4-2-3-5-15(14)25(20(17)22)21(18)26/h2-6,13,16-17,19-20H,7-11H2,1H3/b23-18+/t13-,16-,17-,19+,20-,22+/m0/s1
n/an/a 100n/an/an/an/an/an/a
The German University in Cairo
Curated by ChEMBL
Assay Description
Antagonist activity at recombinant human glycine receptor alpha 1 expressed in human tsA201 cells assessed as inhibition of glycine-induced receptor ...
J Nat Prod 79: 2997-3005 (2016)
BindingDB Entry DOI: 10.7270/Q2QZ2D66
Glycine receptor (alpha-1/beta)
(Homo sapiens (Human))
BDBM50232890
(CHEMBL4102677)
Show SMILES [H][C@]12C[C@@]3([H])C4=CCO[C@@]5([H])\C(=N/OC)C(=O)N6c7ccccc7[C@@]1(CCN2C4)[C@]6([H])[C@@]35[H] |r,c:5|
Show InChI InChI=1S/C22H23N3O3/c1-27-23-18-19-17-13-10-16-22(7-8-24(16)11-12(13)6-9-28-19)14-4-2-3-5-15(14)25(20(17)22)21(18)26/h2-6,13,16-17,19-20H,7-11H2,1H3/b23-18+/t13-,16-,17-,19+,20-,22+/m0/s1
n/an/a 214n/an/an/an/an/an/a
The German University in Cairo
Curated by ChEMBL
Assay Description
Antagonist activity at recombinant human glycine receptor alpha 1 beta expressed in human tsA201 cells assessed as inhibition of glycine-induced rece...
J Nat Prod 79: 2997-3005 (2016)
BindingDB Entry DOI: 10.7270/Q2QZ2D66