BDBM50232938 CHEMBL4088509
SMILES: C[C@H]1CC[C@H](CC1)NC(=O)c1cc(nn(Cc2ccc(F)cc2)c1=O)-c1ccc(Cl)c(C)c1
InChI Key: InChIKey=QWXIOMLHSNPVCF-NBEIKUQISA-N
Data: 2 KI  1 IC50
Activity Spreadsheet -- Enzyme Inhibition Constant Data from BindingDB
Found 3 hits for monomerid = 50232938
Trg + Lig
Ki
nM
ΔG°
kcal/mole
IC50
nM
Kd
nM
EC50/IC50
nM
koff
s-1
kon
M-1s-1
pHTemp
°C
Cannabinoid receptor 2
(Homo sapiens (Human))
BDBM50232938
(CHEMBL4088509)
Show SMILES C[C@H]1CC[C@H](CC1)NC(=O)c1cc(nn(Cc2ccc(F)cc2)c1=O)-c1ccc(Cl)c(C)c1 |r,wU:4.7,1.0,(53.55,-14.07,;52.76,-15.39,;53.52,-16.73,;52.74,-18.05,;51.2,-18.03,;50.43,-16.7,;51.22,-15.38,;50.42,-19.36,;48.88,-19.35,;48.12,-18.01,;48.1,-20.68,;46.55,-20.66,;45.78,-21.99,;46.55,-23.33,;48.08,-23.34,;48.84,-24.68,;48.06,-26.01,;46.52,-26,;45.74,-27.32,;46.5,-28.66,;45.72,-29.99,;48.05,-28.67,;48.82,-27.34,;48.86,-22.02,;50.4,-22.03,;44.25,-21.99,;43.48,-20.64,;41.94,-20.64,;41.16,-21.97,;39.62,-21.96,;41.93,-23.31,;41.15,-24.64,;43.47,-23.32,)|
Show InChI InChI=1S/C26H27ClFN3O2/c1-16-3-10-21(11-4-16)29-25(32)22-14-24(19-7-12-23(27)17(2)13-19)30-31(26(22)33)15-18-5-8-20(28)9-6-18/h5-9,12-14,16,21H,3-4,10-11,15H2,1-2H3,(H,29,32)/t16-,21+
Reactome pathway
2n/an/an/an/an/an/an/an/a
University of Sassari
Curated by ChEMBL
Assay Description
Displacement of [3H]CP55940 from human CB2 receptor expressed in HEK293 EBNA cell membranes after 90 mins by liquid scintillation and luminescence co...
Eur J Med Chem 127: 398-412 (2017)
BindingDB Entry DOI: 10.7270/Q26W9D9V
Cannabinoid receptor 1
(Homo sapiens (Human))
BDBM50232938
(CHEMBL4088509)
Show SMILES C[C@H]1CC[C@H](CC1)NC(=O)c1cc(nn(Cc2ccc(F)cc2)c1=O)-c1ccc(Cl)c(C)c1 |r,wU:4.7,1.0,(53.55,-14.07,;52.76,-15.39,;53.52,-16.73,;52.74,-18.05,;51.2,-18.03,;50.43,-16.7,;51.22,-15.38,;50.42,-19.36,;48.88,-19.35,;48.12,-18.01,;48.1,-20.68,;46.55,-20.66,;45.78,-21.99,;46.55,-23.33,;48.08,-23.34,;48.84,-24.68,;48.06,-26.01,;46.52,-26,;45.74,-27.32,;46.5,-28.66,;45.72,-29.99,;48.05,-28.67,;48.82,-27.34,;48.86,-22.02,;50.4,-22.03,;44.25,-21.99,;43.48,-20.64,;41.94,-20.64,;41.16,-21.97,;39.62,-21.96,;41.93,-23.31,;41.15,-24.64,;43.47,-23.32,)|
Show InChI InChI=1S/C26H27ClFN3O2/c1-16-3-10-21(11-4-16)29-25(32)22-14-24(19-7-12-23(27)17(2)13-19)30-31(26(22)33)15-18-5-8-20(28)9-6-18/h5-9,12-14,16,21H,3-4,10-11,15H2,1-2H3,(H,29,32)/t16-,21+
NCI pathway
Reactome pathway
>4.00E+3n/an/an/an/an/an/an/an/a
University of Sassari
Curated by ChEMBL
Assay Description
Displacement of [3H]CP55940 from human CB1 receptor expressed in HEK293 EBNA cell membranes after 90 mins by liquid scintillation and luminescence co...
Eur J Med Chem 127: 398-412 (2017)
BindingDB Entry DOI: 10.7270/Q26W9D9V
Cannabinoid receptor 2
(Homo sapiens (Human))
BDBM50232938
(CHEMBL4088509)
Show SMILES C[C@H]1CC[C@H](CC1)NC(=O)c1cc(nn(Cc2ccc(F)cc2)c1=O)-c1ccc(Cl)c(C)c1 |r,wU:4.7,1.0,(53.55,-14.07,;52.76,-15.39,;53.52,-16.73,;52.74,-18.05,;51.2,-18.03,;50.43,-16.7,;51.22,-15.38,;50.42,-19.36,;48.88,-19.35,;48.12,-18.01,;48.1,-20.68,;46.55,-20.66,;45.78,-21.99,;46.55,-23.33,;48.08,-23.34,;48.84,-24.68,;48.06,-26.01,;46.52,-26,;45.74,-27.32,;46.5,-28.66,;45.72,-29.99,;48.05,-28.67,;48.82,-27.34,;48.86,-22.02,;50.4,-22.03,;44.25,-21.99,;43.48,-20.64,;41.94,-20.64,;41.16,-21.97,;39.62,-21.96,;41.93,-23.31,;41.15,-24.64,;43.47,-23.32,)|
Show InChI InChI=1S/C26H27ClFN3O2/c1-16-3-10-21(11-4-16)29-25(32)22-14-24(19-7-12-23(27)17(2)13-19)30-31(26(22)33)15-18-5-8-20(28)9-6-18/h5-9,12-14,16,21H,3-4,10-11,15H2,1-2H3,(H,29,32)/t16-,21+
Reactome pathway
n/an/a 21n/an/an/an/an/an/a
University of Sassari
Curated by ChEMBL
Assay Description
Inverse agonist activity at human CB2 receptor expressed in HEK293 EBNA cell membranes after 30 mins by [35S]-GTPgammaS binding assay
Eur J Med Chem 127: 398-412 (2017)
BindingDB Entry DOI: 10.7270/Q26W9D9V