BDBM50233039 (S)-4-methyl-2-[(S)-2,2,2-trifluoro-1-(4'-methanesulfonyl-biphenyl-4-yl)-ethylamino]-pentanoic acid (cyano-dicyclopropyl-methyl)-amide::CHEMBL252383
SMILES: CC(C)C[C@H](N[C@@H](c1ccc(cc1)-c1ccc(cc1)S(C)(=O)=O)C(F)(F)F)C(=O)NC(C#N)(C1CC1)C1CC1
InChI Key: InChIKey=BHXUXLQVSXLWEI-UIOOFZCWSA-N
Data: 4 IC50
Activity Spreadsheet -- Enzyme Inhibition Constant Data from BindingDB
Found 4 hits for monomerid = 50233039
Trg + Lig
Ki
nM
ΔG°
kcal/mole
IC50
nM
Kd
nM
EC50/IC50
nM
koff
s-1
kon
M-1s-1
pHTemp
°C
Procathepsin L
(Homo sapiens (Human))
BDBM50233039
((S)-4-methyl-2-[(S)-2,2,2-trifluoro-1-(4'-methanes...)
Show SMILES CC(C)C[C@H](N[C@@H](c1ccc(cc1)-c1ccc(cc1)S(C)(=O)=O)C(F)(F)F)C(=O)NC(C#N)(C1CC1)C1CC1
Show InChI InChI=1S/C29H34F3N3O3S/c1-18(2)16-25(27(36)35-28(17-33,22-10-11-22)23-12-13-23)34-26(29(30,31)32)21-6-4-19(5-7-21)20-8-14-24(15-9-20)39(3,37)38/h4-9,14-15,18,22-23,25-26,34H,10-13,16H2,1-3H3,(H,35,36)/t25-,26-/m0/s1
Reactome pathway
n/an/a 456n/an/an/an/an/an/a
Merck Frosst Centre for Therapeutic Research
Curated by ChEMBL
Assay Description
Inhibition of cathepsin L
Bioorg Med Chem Lett 18: 923-8 (2008)
Article DOI: 10.1016/j.bmcl.2007.12.047
BindingDB Entry DOI: 10.7270/Q21J9BM2
Cathepsin S
(Homo sapiens (Human))
BDBM50233039
((S)-4-methyl-2-[(S)-2,2,2-trifluoro-1-(4'-methanes...)
Show SMILES CC(C)C[C@H](N[C@@H](c1ccc(cc1)-c1ccc(cc1)S(C)(=O)=O)C(F)(F)F)C(=O)NC(C#N)(C1CC1)C1CC1
Show InChI InChI=1S/C29H34F3N3O3S/c1-18(2)16-25(27(36)35-28(17-33,22-10-11-22)23-12-13-23)34-26(29(30,31)32)21-6-4-19(5-7-21)20-8-14-24(15-9-20)39(3,37)38/h4-9,14-15,18,22-23,25-26,34H,10-13,16H2,1-3H3,(H,35,36)/t25-,26-/m0/s1
Reactome pathway
n/an/a 266n/an/an/an/an/an/a
Merck Frosst Centre for Therapeutic Research
Curated by ChEMBL
Assay Description
Inhibition of cathepsin S
Bioorg Med Chem Lett 18: 923-8 (2008)
Article DOI: 10.1016/j.bmcl.2007.12.047
BindingDB Entry DOI: 10.7270/Q21J9BM2
Cathepsin B
(Homo sapiens (Human))
BDBM50233039
((S)-4-methyl-2-[(S)-2,2,2-trifluoro-1-(4'-methanes...)
Show SMILES CC(C)C[C@H](N[C@@H](c1ccc(cc1)-c1ccc(cc1)S(C)(=O)=O)C(F)(F)F)C(=O)NC(C#N)(C1CC1)C1CC1
Show InChI InChI=1S/C29H34F3N3O3S/c1-18(2)16-25(27(36)35-28(17-33,22-10-11-22)23-12-13-23)34-26(29(30,31)32)21-6-4-19(5-7-21)20-8-14-24(15-9-20)39(3,37)38/h4-9,14-15,18,22-23,25-26,34H,10-13,16H2,1-3H3,(H,35,36)/t25-,26-/m0/s1
Reactome pathway
n/an/a>1.00E+4n/an/an/an/an/an/a
Merck Frosst Centre for Therapeutic Research
Curated by ChEMBL
Assay Description
Inhibition of cathepsin B
Bioorg Med Chem Lett 18: 923-8 (2008)
Article DOI: 10.1016/j.bmcl.2007.12.047
BindingDB Entry DOI: 10.7270/Q21J9BM2
Cathepsin K
(Homo sapiens (Human))
BDBM50233039
((S)-4-methyl-2-[(S)-2,2,2-trifluoro-1-(4'-methanes...)
Show SMILES CC(C)C[C@H](N[C@@H](c1ccc(cc1)-c1ccc(cc1)S(C)(=O)=O)C(F)(F)F)C(=O)NC(C#N)(C1CC1)C1CC1
Show InChI InChI=1S/C29H34F3N3O3S/c1-18(2)16-25(27(36)35-28(17-33,22-10-11-22)23-12-13-23)34-26(29(30,31)32)21-6-4-19(5-7-21)20-8-14-24(15-9-20)39(3,37)38/h4-9,14-15,18,22-23,25-26,34H,10-13,16H2,1-3H3,(H,35,36)/t25-,26-/m0/s1
Reactome pathway
n/an/a 0.300n/an/an/an/an/an/a
Merck Frosst Centre for Therapeutic Research
Curated by ChEMBL
Assay Description
Inhibition of humanized rabbit cathepsin K
Bioorg Med Chem Lett 18: 923-8 (2008)
Article DOI: 10.1016/j.bmcl.2007.12.047
BindingDB Entry DOI: 10.7270/Q21J9BM2