BDBM50233264 CHEMBL4085105
SMILES: [#6]-[#8]-[#6](=O)-[#6](-[#6])-[#6]\[#6](=[#6](/c1ccc(-[#8])cc1)-c1ccc(-[#8])cc1)-c1ccccc1
InChI Key: InChIKey=AVIAFRILYRGIDG-UHFFFAOYSA-N
Data: 2 IC50
Activity Spreadsheet -- Enzyme Inhibition Constant Data from BindingDB
Found 2 hits for monomerid = 50233264
Trg + Lig
Ki
nM
ΔG°
kcal/mole
IC50
nM
Kd
nM
EC50/IC50
nM
koff
s-1
kon
M-1s-1
pHTemp
°C
Estrogen-related receptor gamma
(Homo sapiens (Human))
BDBM50233264
(CHEMBL4085105)
Show SMILES [#6]-[#8]-[#6](=O)-[#6](-[#6])-[#6]\[#6](=[#6](/c1ccc(-[#8])cc1)-c1ccc(-[#8])cc1)-c1ccccc1
Show InChI InChI=1S/C25H24O4/c1-17(25(28)29-2)16-23(18-6-4-3-5-7-18)24(19-8-12-21(26)13-9-19)20-10-14-22(27)15-11-20/h3-15,17,26-27H,16H2,1-2H3
Reactome pathway
n/an/a 5.50E+3n/an/an/an/an/an/a
The Beckman Research Institute
Curated by ChEMBL
Assay Description
Inverse agonist activity at GAL4-DNA binding domain-fused mouse ERRgamma ligand binding domain expressed in African green monkey CV1 cells assessed a...
Bioorg Med Chem 25: 1585-1599 (2017)
BindingDB Entry DOI: 10.7270/Q2DF6TFV
Steroid hormone receptor ERR2
(Homo sapiens (Human))
BDBM50233264
(CHEMBL4085105)
Show SMILES [#6]-[#8]-[#6](=O)-[#6](-[#6])-[#6]\[#6](=[#6](/c1ccc(-[#8])cc1)-c1ccc(-[#8])cc1)-c1ccccc1
Show InChI InChI=1S/C25H24O4/c1-17(25(28)29-2)16-23(18-6-4-3-5-7-18)24(19-8-12-21(26)13-9-19)20-10-14-22(27)15-11-20/h3-15,17,26-27H,16H2,1-2H3
n/an/a 300n/an/an/an/an/an/a
The Beckman Research Institute
Curated by ChEMBL
Assay Description
Inverse agonist activity at GAL4-DNA binding domain-fused human ERRbeta ligand binding domain expressed in African green monkey CV1 cells assessed as...
Bioorg Med Chem 25: 1585-1599 (2017)
BindingDB Entry DOI: 10.7270/Q2DF6TFV