BDBM50233265 CHEMBL4065193
SMILES: [#6]-[#8]-[#6](=O)-[#6]-[#6]\[#6](=[#6](/c1ccc(-[#8])cc1)-c1ccc(-[#8])cc1)-c1ccccc1
InChI Key: InChIKey=GJOOJSKMPRJUDY-UHFFFAOYSA-N
Data: 2 IC50
Activity Spreadsheet -- Enzyme Inhibition Constant Data from BindingDB
Found 2 hits for monomerid = 50233265
Trg + Lig
Ki
nM
ΔG°
kcal/mole
IC50
nM
Kd
nM
EC50/IC50
nM
koff
s-1
kon
M-1s-1
pHTemp
°C
Estrogen-related receptor gamma
(Homo sapiens (Human))
BDBM50233265
(CHEMBL4065193)
Show SMILES [#6]-[#8]-[#6](=O)-[#6]-[#6]\[#6](=[#6](/c1ccc(-[#8])cc1)-c1ccc(-[#8])cc1)-c1ccccc1
Show InChI InChI=1S/C24H22O4/c1-28-23(27)16-15-22(17-5-3-2-4-6-17)24(18-7-11-20(25)12-8-18)19-9-13-21(26)14-10-19/h2-14,25-26H,15-16H2,1H3
Reactome pathway
n/an/a 6.50E+3n/an/an/an/an/an/a
The Beckman Research Institute
Curated by ChEMBL
Assay Description
Inverse agonist activity at GAL4-DNA binding domain-fused mouse ERRgamma ligand binding domain expressed in African green monkey CV1 cells assessed a...
Bioorg Med Chem 25: 1585-1599 (2017)
BindingDB Entry DOI: 10.7270/Q2DF6TFV
Steroid hormone receptor ERR2
(Homo sapiens (Human))
BDBM50233265
(CHEMBL4065193)
Show SMILES [#6]-[#8]-[#6](=O)-[#6]-[#6]\[#6](=[#6](/c1ccc(-[#8])cc1)-c1ccc(-[#8])cc1)-c1ccccc1
Show InChI InChI=1S/C24H22O4/c1-28-23(27)16-15-22(17-5-3-2-4-6-17)24(18-7-11-20(25)12-8-18)19-9-13-21(26)14-10-19/h2-14,25-26H,15-16H2,1H3
n/an/a 600n/an/an/an/an/an/a
The Beckman Research Institute
Curated by ChEMBL
Assay Description
Inverse agonist activity at GAL4-DNA binding domain-fused human ERRbeta ligand binding domain expressed in African green monkey CV1 cells assessed as...
Bioorg Med Chem 25: 1585-1599 (2017)
BindingDB Entry DOI: 10.7270/Q2DF6TFV