BDBM50233292 CHEMBL4062167
SMILES: COC(=O)c1cccnc1N[C@@H]1CC[C@@H](C)N(C1)C(=O)c1ccccc1-n1nccn1
InChI Key: InChIKey=XJPXAOVFVWBQMW-HZPDHXFCSA-N
Data: 2 KI  2 IC50
Activity Spreadsheet -- Enzyme Inhibition Constant Data from BindingDB
Found 4 hits for monomerid = 50233292
Trg + Lig
Ki
nM
ΔG°
kcal/mole
IC50
nM
Kd
nM
EC50/IC50
nM
koff
s-1
kon
M-1s-1
pHTemp
°C
Orexin receptor type 2
(Homo sapiens (Human))
BDBM50233292
(CHEMBL4062167)
Show SMILES COC(=O)c1cccnc1N[C@@H]1CC[C@@H](C)N(C1)C(=O)c1ccccc1-n1nccn1 |r|
Show InChI InChI=1S/C22H24N6O3/c1-15-9-10-16(26-20-18(22(30)31-2)7-5-11-23-20)14-27(15)21(29)17-6-3-4-8-19(17)28-24-12-13-25-28/h3-8,11-13,15-16H,9-10,14H2,1-2H3,(H,23,26)/t15-,16-/m1/s1
Reactome pathway
0.400n/an/an/an/an/an/an/an/a
Merck& Co.
Curated by ChEMBL
Assay Description
Displacement of [3H](S)-N-(2-(1H-pyrrol-1-yl)phenyl)-1-(2-(1-methyl-1H-benzo[d]imidazol-2-ylthio)acetyl)pyrrolidine-2-carboxamide from human OX2R exp...
Bioorg Med Chem Lett 27: 1364-1370 (2017)
BindingDB Entry DOI: 10.7270/Q2WH2S8Q
Orexin receptor type 1
(Homo sapiens (Human))
BDBM50233292
(CHEMBL4062167)
Show SMILES COC(=O)c1cccnc1N[C@@H]1CC[C@@H](C)N(C1)C(=O)c1ccccc1-n1nccn1 |r|
Show InChI InChI=1S/C22H24N6O3/c1-15-9-10-16(26-20-18(22(30)31-2)7-5-11-23-20)14-27(15)21(29)17-6-3-4-8-19(17)28-24-12-13-25-28/h3-8,11-13,15-16H,9-10,14H2,1-2H3,(H,23,26)/t15-,16-/m1/s1
Reactome pathway
12n/an/an/an/an/an/an/an/a
Merck& Co.
Curated by ChEMBL
Assay Description
Displacement of [3H](S)-N-(biphenyl-2-yl)-1-(2-(1-methyl-1H-benzo[d]imidazol-2-ylthio)acetyl)pyrrolidine-2-carboxamide from human OX1R expressed in C...
Bioorg Med Chem Lett 27: 1364-1370 (2017)
BindingDB Entry DOI: 10.7270/Q2WH2S8Q
Orexin receptor type 2
(Homo sapiens (Human))
BDBM50233292
(CHEMBL4062167)
Show SMILES COC(=O)c1cccnc1N[C@@H]1CC[C@@H](C)N(C1)C(=O)c1ccccc1-n1nccn1 |r|
Show InChI InChI=1S/C22H24N6O3/c1-15-9-10-16(26-20-18(22(30)31-2)7-5-11-23-20)14-27(15)21(29)17-6-3-4-8-19(17)28-24-12-13-25-28/h3-8,11-13,15-16H,9-10,14H2,1-2H3,(H,23,26)/t15-,16-/m1/s1
Reactome pathway
n/an/a 38n/an/an/an/an/an/a
Merck& Co.
Curated by ChEMBL
Assay Description
Antagonist activity at human OX2R expressed in CHOK1 cells assessed as reduction in orexin A-induced calcium flux preincubated followed by orexin A a...
Bioorg Med Chem Lett 27: 1364-1370 (2017)
BindingDB Entry DOI: 10.7270/Q2WH2S8Q
Orexin receptor type 1
(Homo sapiens (Human))
BDBM50233292
(CHEMBL4062167)
Show SMILES COC(=O)c1cccnc1N[C@@H]1CC[C@@H](C)N(C1)C(=O)c1ccccc1-n1nccn1 |r|
Show InChI InChI=1S/C22H24N6O3/c1-15-9-10-16(26-20-18(22(30)31-2)7-5-11-23-20)14-27(15)21(29)17-6-3-4-8-19(17)28-24-12-13-25-28/h3-8,11-13,15-16H,9-10,14H2,1-2H3,(H,23,26)/t15-,16-/m1/s1
Reactome pathway
n/an/a 69n/an/an/an/an/an/a
Merck& Co.
Curated by ChEMBL
Assay Description
Antagonist activity at human OX1R expressed in CHOK1 cells assessed as reduction in orexin A-induced calcium flux preincubated followed by orexin A a...
Bioorg Med Chem Lett 27: 1364-1370 (2017)
BindingDB Entry DOI: 10.7270/Q2WH2S8Q