BDBM50233294 CHEMBL4079757
SMILES: C[C@@H]1CC[C@H](CN1C(=O)c1nc(NC(C)=O)ccc1-c1ccccc1)Oc1nccc(C#N)c1C
InChI Key: InChIKey=JUMHMLNVFHEBSN-VGOFRKELSA-N
Data: 2 KI  2 IC50
Activity Spreadsheet -- Enzyme Inhibition Constant Data from BindingDB
Found 4 hits for monomerid = 50233294
Trg + Lig
Ki
nM
ΔG°
kcal/mole
IC50
nM
Kd
nM
EC50/IC50
nM
koff
s-1
kon
M-1s-1
pHTemp
°C
Orexin receptor type 2
(Homo sapiens (Human))
BDBM50233294
(CHEMBL4079757)
Show SMILES C[C@@H]1CC[C@H](CN1C(=O)c1nc(NC(C)=O)ccc1-c1ccccc1)Oc1nccc(C#N)c1C |r|
Show InChI InChI=1S/C27H27N5O3/c1-17-9-10-22(35-26-18(2)21(15-28)13-14-29-26)16-32(17)27(34)25-23(20-7-5-4-6-8-20)11-12-24(31-25)30-19(3)33/h4-8,11-14,17,22H,9-10,16H2,1-3H3,(H,30,31,33)/t17-,22-/m1/s1
Reactome pathway
0.600n/an/an/an/an/an/an/an/a
Merck& Co.
Curated by ChEMBL
Assay Description
Displacement of [3H](S)-N-(2-(1H-pyrrol-1-yl)phenyl)-1-(2-(1-methyl-1H-benzo[d]imidazol-2-ylthio)acetyl)pyrrolidine-2-carboxamide from human OX2R exp...
Bioorg Med Chem Lett 27: 1364-1370 (2017)
BindingDB Entry DOI: 10.7270/Q2WH2S8Q
Orexin receptor type 1
(Homo sapiens (Human))
BDBM50233294
(CHEMBL4079757)
Show SMILES C[C@@H]1CC[C@H](CN1C(=O)c1nc(NC(C)=O)ccc1-c1ccccc1)Oc1nccc(C#N)c1C |r|
Show InChI InChI=1S/C27H27N5O3/c1-17-9-10-22(35-26-18(2)21(15-28)13-14-29-26)16-32(17)27(34)25-23(20-7-5-4-6-8-20)11-12-24(31-25)30-19(3)33/h4-8,11-14,17,22H,9-10,16H2,1-3H3,(H,30,31,33)/t17-,22-/m1/s1
Reactome pathway
12n/an/an/an/an/an/an/an/a
Merck& Co.
Curated by ChEMBL
Assay Description
Displacement of [3H](S)-N-(biphenyl-2-yl)-1-(2-(1-methyl-1H-benzo[d]imidazol-2-ylthio)acetyl)pyrrolidine-2-carboxamide from human OX1R expressed in C...
Bioorg Med Chem Lett 27: 1364-1370 (2017)
BindingDB Entry DOI: 10.7270/Q2WH2S8Q
Orexin receptor type 2
(Homo sapiens (Human))
BDBM50233294
(CHEMBL4079757)
Show SMILES C[C@@H]1CC[C@H](CN1C(=O)c1nc(NC(C)=O)ccc1-c1ccccc1)Oc1nccc(C#N)c1C |r|
Show InChI InChI=1S/C27H27N5O3/c1-17-9-10-22(35-26-18(2)21(15-28)13-14-29-26)16-32(17)27(34)25-23(20-7-5-4-6-8-20)11-12-24(31-25)30-19(3)33/h4-8,11-14,17,22H,9-10,16H2,1-3H3,(H,30,31,33)/t17-,22-/m1/s1
Reactome pathway
n/an/a 38n/an/an/an/an/an/a
Merck& Co.
Curated by ChEMBL
Assay Description
Antagonist activity at human OX2R expressed in CHOK1 cells assessed as reduction in orexin A-induced calcium flux preincubated followed by orexin A a...
Bioorg Med Chem Lett 27: 1364-1370 (2017)
BindingDB Entry DOI: 10.7270/Q2WH2S8Q
Orexin receptor type 1
(Homo sapiens (Human))
BDBM50233294
(CHEMBL4079757)
Show SMILES C[C@@H]1CC[C@H](CN1C(=O)c1nc(NC(C)=O)ccc1-c1ccccc1)Oc1nccc(C#N)c1C |r|
Show InChI InChI=1S/C27H27N5O3/c1-17-9-10-22(35-26-18(2)21(15-28)13-14-29-26)16-32(17)27(34)25-23(20-7-5-4-6-8-20)11-12-24(31-25)30-19(3)33/h4-8,11-14,17,22H,9-10,16H2,1-3H3,(H,30,31,33)/t17-,22-/m1/s1
Reactome pathway
n/an/a 74n/an/an/an/an/an/a
Merck& Co.
Curated by ChEMBL
Assay Description
Antagonist activity at human OX1R expressed in CHOK1 cells assessed as reduction in orexin A-induced calcium flux preincubated followed by orexin A a...
Bioorg Med Chem Lett 27: 1364-1370 (2017)
BindingDB Entry DOI: 10.7270/Q2WH2S8Q