BDBM50233395 CHEMBL4090257
SMILES: Nc1nccn2c(nc(-c3ccc(cc3)C(=O)Nc3cc(ccn3)C(F)(F)F)c12)[C@@H]1CCC[C@@H](C1)c1noc(=O)[nH]1
InChI Key: InChIKey=AZKCDBIMIYDADE-DLBZAZTESA-N
Data: 2 IC50
Activity Spreadsheet -- Enzyme Inhibition Constant Data from BindingDB
Found 2 hits for monomerid = 50233395
Trg + Lig
Ki
nM
ΔG°
kcal/mole
IC50
nM
Kd
nM
EC50/IC50
nM
koff
s-1
kon
M-1s-1
pHTemp
°C
Tyrosine-protein kinase BTK
(Homo sapiens (Human))
BDBM50233395
(CHEMBL4090257)
Show SMILES Nc1nccn2c(nc(-c3ccc(cc3)C(=O)Nc3cc(ccn3)C(F)(F)F)c12)[C@@H]1CCC[C@@H](C1)c1noc(=O)[nH]1 |r|
Show InChI InChI=1S/C27H23F3N8O3/c28-27(29,30)18-8-9-32-19(13-18)34-25(39)15-6-4-14(5-7-15)20-21-22(31)33-10-11-38(21)24(35-20)17-3-1-2-16(12-17)23-36-26(40)41-37-23/h4-11,13,16-17H,1-3,12H2,(H2,31,33)(H,32,34,39)(H,36,37,40)/t16-,17+/m0/s1
NCI pathway
Reactome pathway
n/an/a 1.40n/an/an/an/an/an/a
Merck & Co Inc
Curated by ChEMBL
Assay Description
Inhibition of 6-His-tagged recombinant full length BTK (unknown origin) expressed in baculovirus-transfected Sf9 cells using Biotin-EQEDEPEGDYFEWLE-N...
Bioorg Med Chem Lett 27: 1471-1477 (2017)
BindingDB Entry DOI: 10.7270/Q20867K5
Tyrosine-protein kinase BTK
(Homo sapiens (Human))
BDBM50233395
(CHEMBL4090257)
Show SMILES Nc1nccn2c(nc(-c3ccc(cc3)C(=O)Nc3cc(ccn3)C(F)(F)F)c12)[C@@H]1CCC[C@@H](C1)c1noc(=O)[nH]1 |r|
Show InChI InChI=1S/C27H23F3N8O3/c28-27(29,30)18-8-9-32-19(13-18)34-25(39)15-6-4-14(5-7-15)20-21-22(31)33-10-11-38(21)24(35-20)17-3-1-2-16(12-17)23-36-26(40)41-37-23/h4-11,13,16-17H,1-3,12H2,(H2,31,33)(H,32,34,39)(H,36,37,40)/t16-,17+/m0/s1
NCI pathway
Reactome pathway
n/an/a 979n/an/an/an/an/an/a
Merck & Co Inc
Curated by ChEMBL
Assay Description
Inhibition of BTK in human PBMC
Bioorg Med Chem Lett 27: 1471-1477 (2017)
BindingDB Entry DOI: 10.7270/Q20867K5