BDBM50233600 CHEMBL4098428::US10882838, Example 1.10
SMILES: [H][C@@]12CC(C)=CC[C@@]1([H])C(C)(C)Oc1cc(cc(O)c21)C(C)(C)C(=O)OCCCn1ccnc1
InChI Key: InChIKey=WJRVVIKOSPKUCK-WOJBJXKFSA-N
Data: 6 KI  1 EC50
Activity Spreadsheet -- Enzyme Inhibition Constant Data from BindingDB
Found 7 hits for monomerid = 50233600
Trg + Lig
Ki
nM
ΔG°
kcal/mole
IC50
nM
Kd
nM
EC50/IC50
nM
koff
s-1
kon
M-1s-1
pHTemp
°C
Cannabinoid receptor 2
(Homo sapiens (Human))
BDBM50233600
(CHEMBL4098428 | US10882838, Example 1.10)
Show SMILES [H][C@@]12CC(C)=CC[C@@]1([H])C(C)(C)Oc1cc(cc(O)c21)C(C)(C)C(=O)OCCCn1ccnc1 |r,c:4|
Show InChI InChI=1S/C26H34N2O4/c1-17-7-8-20-19(13-17)23-21(29)14-18(15-22(23)32-26(20,4)5)25(2,3)24(30)31-12-6-10-28-11-9-27-16-28/h7,9,11,14-16,19-20,29H,6,8,10,12-13H2,1-5H3/t19-,20-/m1/s1
Reactome pathway
US Patent
1.20n/an/an/an/an/an/an/an/a
NORTHEASTERN UNIVERSITY
US Patent
Assay Description
All the cannabinoids discussed in this invention are tested for their ability to bind to CB1 and CB2 receptors using membranes from rat brain or HEK2...
US Patent US10882838 (2021)
Cannabinoid receptor 2
(Homo sapiens (Human))
BDBM50233600
(CHEMBL4098428 | US10882838, Example 1.10)
Show SMILES [H][C@@]12CC(C)=CC[C@@]1([H])C(C)(C)Oc1cc(cc(O)c21)C(C)(C)C(=O)OCCCn1ccnc1 |r,c:4|
Show InChI InChI=1S/C26H34N2O4/c1-17-7-8-20-19(13-17)23-21(29)14-18(15-22(23)32-26(20,4)5)25(2,3)24(30)31-12-6-10-28-11-9-27-16-28/h7,9,11,14-16,19-20,29H,6,8,10,12-13H2,1-5H3/t19-,20-/m1/s1
Reactome pathway
1.30n/an/an/an/an/an/an/an/a
Northeastern University
Curated by ChEMBL
Assay Description
Displacement of [3H]CP-55,940 from human CB2 receptor expressed in HEK293 cells by scintillation counting method
J Med Chem 58: 665-81 (2015)
BindingDB Entry DOI: 10.7270/Q2K076HR
Cannabinoid receptor
(MOUSE)
BDBM50233600
(CHEMBL4098428 | US10882838, Example 1.10)
Show SMILES [H][C@@]12CC(C)=CC[C@@]1([H])C(C)(C)Oc1cc(cc(O)c21)C(C)(C)C(=O)OCCCn1ccnc1 |r,c:4|
Show InChI InChI=1S/C26H34N2O4/c1-17-7-8-20-19(13-17)23-21(29)14-18(15-22(23)32-26(20,4)5)25(2,3)24(30)31-12-6-10-28-11-9-27-16-28/h7,9,11,14-16,19-20,29H,6,8,10,12-13H2,1-5H3/t19-,20-/m1/s1
Reactome pathway
US Patent
2n/an/an/an/an/an/an/an/a
NORTHEASTERN UNIVERSITY
US Patent
Assay Description
All the cannabinoids discussed in this invention are tested for their ability to bind to CB1 and CB2 receptors using membranes from rat brain or HEK2...
US Patent US10882838 (2021)
Cannabinoid receptor 2
(MOUSE)
BDBM50233600
(CHEMBL4098428 | US10882838, Example 1.10)
Show SMILES [H][C@@]12CC(C)=CC[C@@]1([H])C(C)(C)Oc1cc(cc(O)c21)C(C)(C)C(=O)OCCCn1ccnc1 |r,c:4|
Show InChI InChI=1S/C26H34N2O4/c1-17-7-8-20-19(13-17)23-21(29)14-18(15-22(23)32-26(20,4)5)25(2,3)24(30)31-12-6-10-28-11-9-27-16-28/h7,9,11,14-16,19-20,29H,6,8,10,12-13H2,1-5H3/t19-,20-/m1/s1
Reactome pathway
2.10n/an/an/an/an/an/an/an/a
Northeastern University
Curated by ChEMBL
Assay Description
Displacement of [3H]CP-55,940 from mouse CB2 receptor expressed in HEK293 cells by scintillation counting method
J Med Chem 58: 665-81 (2015)
BindingDB Entry DOI: 10.7270/Q2K076HR
Cannabinoid receptor
(Rattus norvegicus (rat))
BDBM50233600
(CHEMBL4098428 | US10882838, Example 1.10)
Show SMILES [H][C@@]12CC(C)=CC[C@@]1([H])C(C)(C)Oc1cc(cc(O)c21)C(C)(C)C(=O)OCCCn1ccnc1 |r,c:4|
Show InChI InChI=1S/C26H34N2O4/c1-17-7-8-20-19(13-17)23-21(29)14-18(15-22(23)32-26(20,4)5)25(2,3)24(30)31-12-6-10-28-11-9-27-16-28/h7,9,11,14-16,19-20,29H,6,8,10,12-13H2,1-5H3/t19-,20-/m1/s1
Reactome pathway
US Patent
3.40n/an/an/an/an/an/an/an/a
NORTHEASTERN UNIVERSITY
US Patent
Assay Description
All the cannabinoids discussed in this invention are tested for their ability to bind to CB1 and CB2 receptors using membranes from rat brain or HEK2...
US Patent US10882838 (2021)
Cannabinoid receptor 1
(Rattus norvegicus (rat))
BDBM50233600
(CHEMBL4098428 | US10882838, Example 1.10)
Show SMILES [H][C@@]12CC(C)=CC[C@@]1([H])C(C)(C)Oc1cc(cc(O)c21)C(C)(C)C(=O)OCCCn1ccnc1 |r,c:4|
Show InChI InChI=1S/C26H34N2O4/c1-17-7-8-20-19(13-17)23-21(29)14-18(15-22(23)32-26(20,4)5)25(2,3)24(30)31-12-6-10-28-11-9-27-16-28/h7,9,11,14-16,19-20,29H,6,8,10,12-13H2,1-5H3/t19-,20-/m1/s1
Reactome pathway
3.40n/an/an/an/an/an/an/an/a
Northeastern University
Curated by ChEMBL
Assay Description
Displacement of [3H]CP-55,940 from CB1 receptor in rat brain membranes by scintillation counting method
J Med Chem 58: 665-81 (2015)
BindingDB Entry DOI: 10.7270/Q2K076HR
Cannabinoid receptor 1
(Rattus norvegicus (rat))
BDBM50233600
(CHEMBL4098428 | US10882838, Example 1.10)
Show SMILES [H][C@@]12CC(C)=CC[C@@]1([H])C(C)(C)Oc1cc(cc(O)c21)C(C)(C)C(=O)OCCCn1ccnc1 |r,c:4|
Show InChI InChI=1S/C26H34N2O4/c1-17-7-8-20-19(13-17)23-21(29)14-18(15-22(23)32-26(20,4)5)25(2,3)24(30)31-12-6-10-28-11-9-27-16-28/h7,9,11,14-16,19-20,29H,6,8,10,12-13H2,1-5H3/t19-,20-/m1/s1
Reactome pathway
n/an/an/an/a 1n/an/an/an/a
Northeastern University
Curated by ChEMBL
Assay Description
Agonist activity at CB1 receptor in rat brain membranes assessed as reduction in forskolin-stimulated cAMP level measured from 3 data points after 30...
J Med Chem 58: 665-81 (2015)
BindingDB Entry DOI: 10.7270/Q2K076HR