BDBM50233705 4-cyano-N-(2-(4-methylpiperidin-1-yl)-4-(piperazin-1-yl)phenyl)-1H-pyrrole-2-carboxamide::CHEMBL254908
SMILES: CC1CCN(CC1)c1cc(ccc1NC(=O)c1cc(c[nH]1)C#N)N1CCNCC1
InChI Key: InChIKey=YPPDZAOVZSJMKT-UHFFFAOYSA-N
Data: 1 IC50
Activity Spreadsheet -- Enzyme Inhibition Constant Data from BindingDB
Found 1 hit for monomerid = 50233705
Trg + Lig
Ki
nM
ΔG°
kcal/mole
IC50
nM
Kd
nM
EC50/IC50
nM
koff
s-1
kon
M-1s-1
pHTemp
°C
Macrophage colony stimulating factor receptor
(Homo sapiens (Human))
BDBM50233705
(4-cyano-N-(2-(4-methylpiperidin-1-yl)-4-(piperazin...)
Show SMILES CC1CCN(CC1)c1cc(ccc1NC(=O)c1cc(c[nH]1)C#N)N1CCNCC1
Show InChI InChI=1S/C22H28N6O/c1-16-4-8-28(9-5-16)21-13-18(27-10-6-24-7-11-27)2-3-19(21)26-22(29)20-12-17(14-23)15-25-20/h2-3,12-13,15-16,24-25H,4-11H2,1H3,(H,26,29)
n/an/a 1n/an/an/an/an/an/a
Johnson & Johnson Pharmaceutical Research & Development
Curated by ChEMBL
Assay Description
Inhibition of human cytoplasmic FMS expressed in Sf9-baculovirus system after 80 mins by fluorescence polarization
Bioorg Med Chem Lett 18: 1642-8 (2008)
Article DOI: 10.1016/j.bmcl.2008.01.059
BindingDB Entry DOI: 10.7270/Q2FB52PS