BDBM50233885 CHEMBL4104248
SMILES: Fc1cccc(c1)-c1csc2nc([nH]c(=O)c12)C(=O)NCc1cccc(OCCCOc2nc[nH]n2)c1
InChI Key: InChIKey=MGJMKQSWTURURF-UHFFFAOYSA-N
Data: 1 IC50
Activity Spreadsheet -- Enzyme Inhibition Constant Data from BindingDB
Found 1 hit for monomerid = 50233885
Trg + Lig
Ki
nM
ΔG°
kcal/mole
IC50
nM
Kd
nM
EC50/IC50
nM
koff
s-1
kon
M-1s-1
pHTemp
°C
Collagenase 3
(Homo sapiens (Human))
BDBM50233885
(CHEMBL4104248)
Show SMILES Fc1cccc(c1)-c1csc2nc([nH]c(=O)c12)C(=O)NCc1cccc(OCCCOc2nc[nH]n2)c1
Show InChI InChI=1S/C25H21FN6O4S/c26-17-6-2-5-16(11-17)19-13-37-24-20(19)22(33)30-21(31-24)23(34)27-12-15-4-1-7-18(10-15)35-8-3-9-36-25-28-14-29-32-25/h1-2,4-7,10-11,13-14H,3,8-9,12H2,(H,27,34)(H,28,29,32)(H,30,31,33)
NCI pathway
Reactome pathway
n/an/a 0.140n/an/an/an/an/an/a
Pharmaceutical Company Limited
Curated by ChEMBL
Assay Description
Inhibition of APMA-activated recombinant human MMP-13 using Cy3-PLGLK(Cy5Q)AR-NH2 peptide as substrate measured after 40 mins by spectrofluorimetric ...
J Med Chem 60: 608-626 (2017)
BindingDB Entry DOI: 10.7270/Q2W95CF2