BDBM50233891 CHEMBL4074167
SMILES: Cc1csc2nc([nH]c(=O)c12)C(=O)NCc1cccc(CNC(=O)Cc2nc[nH]n2)c1
InChI Key: InChIKey=JRBXTZBABOIXPG-UHFFFAOYSA-N
Data: 4 IC50
Activity Spreadsheet -- Enzyme Inhibition Constant Data from BindingDB
Found 4 hits for monomerid = 50233891
Trg + Lig
Ki
nM
ΔG°
kcal/mole
IC50
nM
Kd
nM
EC50/IC50
nM
koff
s-1
kon
M-1s-1
pHTemp
°C
72 kDa type IV collagenase
(Homo sapiens (Human))
BDBM50233891
(CHEMBL4074167)
Show SMILES Cc1csc2nc([nH]c(=O)c12)C(=O)NCc1cccc(CNC(=O)Cc2nc[nH]n2)c1
Show InChI InChI=1S/C20H19N7O3S/c1-11-9-31-20-16(11)18(29)25-17(26-20)19(30)22-8-13-4-2-3-12(5-13)7-21-15(28)6-14-23-10-24-27-14/h2-5,9-10H,6-8H2,1H3,(H,21,28)(H,22,30)(H,23,24,27)(H,25,26,29)
Reactome pathway
n/an/a>1.00E+3n/an/an/an/an/an/a
Pharmaceutical Company Limited
Curated by ChEMBL
Assay Description
Inhibition of APMA-activated recombinant human MMP-2 using Cy3-PLGLK(Cy5Q)AR-NH2 peptide as substrate measured after 40 mins by spectrofluorimetric m...
J Med Chem 60: 608-626 (2017)
BindingDB Entry DOI: 10.7270/Q2W95CF2
Matrix metalloproteinase 10
(Homo sapiens (Human))
BDBM50233891
(CHEMBL4074167)
Show SMILES Cc1csc2nc([nH]c(=O)c12)C(=O)NCc1cccc(CNC(=O)Cc2nc[nH]n2)c1
Show InChI InChI=1S/C20H19N7O3S/c1-11-9-31-20-16(11)18(29)25-17(26-20)19(30)22-8-13-4-2-3-12(5-13)7-21-15(28)6-14-23-10-24-27-14/h2-5,9-10H,6-8H2,1H3,(H,21,28)(H,22,30)(H,23,24,27)(H,25,26,29)
Reactome pathway
n/an/a>1.00E+3n/an/an/an/an/an/a
Pharmaceutical Company Limited
Curated by ChEMBL
Assay Description
Inhibition of APMA-activated recombinant human MMP-10 using Cy3-PLGLK(Cy5Q)AR-NH2 peptide as substrate measured after 40 mins by spectrofluorimetric ...
J Med Chem 60: 608-626 (2017)
BindingDB Entry DOI: 10.7270/Q2W95CF2
Neutrophil collagenase
(Homo sapiens (Human))
BDBM50233891
(CHEMBL4074167)
Show SMILES Cc1csc2nc([nH]c(=O)c12)C(=O)NCc1cccc(CNC(=O)Cc2nc[nH]n2)c1
Show InChI InChI=1S/C20H19N7O3S/c1-11-9-31-20-16(11)18(29)25-17(26-20)19(30)22-8-13-4-2-3-12(5-13)7-21-15(28)6-14-23-10-24-27-14/h2-5,9-10H,6-8H2,1H3,(H,21,28)(H,22,30)(H,23,24,27)(H,25,26,29)
Reactome pathway
n/an/a 480n/an/an/an/an/an/a
Pharmaceutical Company Limited
Curated by ChEMBL
Assay Description
Inhibition of APMA-activated recombinant human MMP-8 using Cy3-PLGLK(Cy5Q)AR-NH2 peptide as substrate measured after 40 mins by spectrofluorimetric m...
J Med Chem 60: 608-626 (2017)
BindingDB Entry DOI: 10.7270/Q2W95CF2
Collagenase 3
(Homo sapiens (Human))
BDBM50233891
(CHEMBL4074167)
Show SMILES Cc1csc2nc([nH]c(=O)c12)C(=O)NCc1cccc(CNC(=O)Cc2nc[nH]n2)c1
Show InChI InChI=1S/C20H19N7O3S/c1-11-9-31-20-16(11)18(29)25-17(26-20)19(30)22-8-13-4-2-3-12(5-13)7-21-15(28)6-14-23-10-24-27-14/h2-5,9-10H,6-8H2,1H3,(H,21,28)(H,22,30)(H,23,24,27)(H,25,26,29)
NCI pathway
Reactome pathway
n/an/a 4.90n/an/an/an/an/an/a
Pharmaceutical Company Limited
Curated by ChEMBL
Assay Description
Inhibition of APMA-activated recombinant human MMP-13 using Cy3-PLGLK(Cy5Q)AR-NH2 peptide as substrate measured after 40 mins by spectrofluorimetric ...
J Med Chem 60: 608-626 (2017)
BindingDB Entry DOI: 10.7270/Q2W95CF2