BDBM50233902 CHEMBL4074089
SMILES: COc1ccc(cc1)-c1csc2nc([nH]c(=O)c12)C(=O)NCc1cccc(OCCOc2nc[nH]n2)c1
InChI Key: InChIKey=NVAWHTYSJAOPRL-UHFFFAOYSA-N
Data: 1 IC50
Activity Spreadsheet -- Enzyme Inhibition Constant Data from BindingDB
Found 1 hit for monomerid = 50233902
Trg + Lig
Ki
nM
ΔG°
kcal/mole
IC50
nM
Kd
nM
EC50/IC50
nM
koff
s-1
kon
M-1s-1
pHTemp
°C
Collagenase 3
(Homo sapiens (Human))
BDBM50233902
(CHEMBL4074089)
Show SMILES COc1ccc(cc1)-c1csc2nc([nH]c(=O)c12)C(=O)NCc1cccc(OCCOc2nc[nH]n2)c1
Show InChI InChI=1S/C25H22N6O5S/c1-34-17-7-5-16(6-8-17)19-13-37-24-20(19)22(32)29-21(30-24)23(33)26-12-15-3-2-4-18(11-15)35-9-10-36-25-27-14-28-31-25/h2-8,11,13-14H,9-10,12H2,1H3,(H,26,33)(H,27,28,31)(H,29,30,32)
NCI pathway
Reactome pathway
n/an/a 0.100n/an/an/an/an/an/a
Pharmaceutical Company Limited
Curated by ChEMBL
Assay Description
Inhibition of APMA-activated recombinant human MMP-13 using Cy3-PLGLK(Cy5Q)AR-NH2 peptide as substrate measured after 40 mins by spectrofluorimetric ...
J Med Chem 60: 608-626 (2017)
BindingDB Entry DOI: 10.7270/Q2W95CF2