BDBM50234245 CHEMBL4060854
SMILES: Oc1c(cc(Cl)c2cccnc12)C(Nc1cccnc1)c1ccc(F)cc1F
InChI Key: InChIKey=YGDCNKXGFIGFSB-UHFFFAOYSA-N
Data: 1 IC50
Activity Spreadsheet -- Enzyme Inhibition Constant Data from BindingDB
Found 1 hit for monomerid = 50234245
Trg + Lig
Ki
nM
ΔG°
kcal/mole
IC50
nM
Kd
nM
EC50/IC50
nM
koff
s-1
kon
M-1s-1
pHTemp
°C
Botulinum neurotoxin type A
(Clostridium botulinum)
BDBM50234245
(CHEMBL4060854)
Show SMILES Oc1c(cc(Cl)c2cccnc12)C(Nc1cccnc1)c1ccc(F)cc1F
Show InChI InChI=1S/C21H14ClF2N3O/c22-17-10-16(21(28)20-14(17)4-2-8-26-20)19(27-13-3-1-7-25-11-13)15-6-5-12(23)9-18(15)24/h1-11,19,27-28H
NCI pathway
Reactome pathway
n/an/a 600n/an/an/an/an/an/a
U.S. Army Medical Research Institute of Infectious Diseases
Curated by ChEMBL
Assay Description
Inhibition of protease activity of recombinant full length Clostridium botulinum Hall BoNT/A light chain using SNAP-25 peptide (187 to 203 residues) ...
Bioorg Med Chem Lett 27: 675-678 (2017)
BindingDB Entry DOI: 10.7270/Q2NP26PM