BDBM50234255 CHEMBL4091467
SMILES: Oc1c(cc(Cl)c2cccnc12)C(Nc1ccccn1)c1ccc(F)cc1
InChI Key: InChIKey=HLUDJDVTMXPKKE-UHFFFAOYSA-N
Data: 1 IC50
Activity Spreadsheet -- Enzyme Inhibition Constant Data from BindingDB
Found 1 hit for monomerid = 50234255
Trg + Lig
Ki
nM
ΔG°
kcal/mole
IC50
nM
Kd
nM
EC50/IC50
nM
koff
s-1
kon
M-1s-1
pHTemp
°C
Botulinum neurotoxin type A
(Clostridium botulinum)
BDBM50234255
(CHEMBL4091467)
Show SMILES Oc1c(cc(Cl)c2cccnc12)C(Nc1ccccn1)c1ccc(F)cc1
Show InChI InChI=1S/C21H15ClFN3O/c22-17-12-16(21(27)20-15(17)4-3-11-25-20)19(13-6-8-14(23)9-7-13)26-18-5-1-2-10-24-18/h1-12,19,27H,(H,24,26)
NCI pathway
Reactome pathway
n/an/a 600n/an/an/an/an/an/a
U.S. Army Medical Research Institute of Infectious Diseases
Curated by ChEMBL
Assay Description
Inhibition of protease activity of recombinant full length Clostridium botulinum Hall BoNT/A light chain using SNAP-25 peptide (187 to 203 residues) ...
Bioorg Med Chem Lett 27: 675-678 (2017)
BindingDB Entry DOI: 10.7270/Q2NP26PM