BDBM50234273 CHEMBL4100165
SMILES: Oc1c(cc(Cl)c2cccnc12)C(Nc1ncccn1)c1ccc(F)cc1
InChI Key: InChIKey=LBFWHGGINDRKHJ-UHFFFAOYSA-N
Data: 1 IC50
Activity Spreadsheet -- Enzyme Inhibition Constant Data from BindingDB
Found 1 hit for monomerid = 50234273
Trg + Lig
Ki
nM
ΔG°
kcal/mole
IC50
nM
Kd
nM
EC50/IC50
nM
koff
s-1
kon
M-1s-1
pHTemp
°C
Botulinum neurotoxin type A
(Clostridium botulinum)
BDBM50234273
(CHEMBL4100165)
Show SMILES Oc1c(cc(Cl)c2cccnc12)C(Nc1ncccn1)c1ccc(F)cc1
Show InChI InChI=1S/C20H14ClFN4O/c21-16-11-15(19(27)18-14(16)3-1-8-23-18)17(12-4-6-13(22)7-5-12)26-20-24-9-2-10-25-20/h1-11,17,27H,(H,24,25,26)
NCI pathway
Reactome pathway
n/an/a 700n/an/an/an/an/an/a
U.S. Army Medical Research Institute of Infectious Diseases
Curated by ChEMBL
Assay Description
Inhibition of protease activity of recombinant full length Clostridium botulinum Hall BoNT/A light chain using SNAP-25 peptide (187 to 203 residues) ...
Bioorg Med Chem Lett 27: 675-678 (2017)
BindingDB Entry DOI: 10.7270/Q2NP26PM