BDBM50234381 CHEMBL254530::N-cyclohexyl-4-methyl-3-(pyrrolidin-1-ylsulfonyl)benzamide
SMILES: Cc1ccc(cc1S(=O)(=O)N1CCCC1)C(=O)NC1CCCCC1
InChI Key: InChIKey=RRLQWCBZANOBDY-UHFFFAOYSA-N
Data: 1 EC50
Activity Spreadsheet -- Enzyme Inhibition Constant Data from BindingDB
Found 1 hit for monomerid = 50234381
Trg + Lig
Ki
nM
ΔG°
kcal/mole
IC50
nM
Kd
nM
EC50/IC50
nM
koff
s-1
kon
M-1s-1
pHTemp
°C
Cannabinoid receptor 2
(Homo sapiens (Human))
BDBM50234381
(CHEMBL254530 | N-cyclohexyl-4-methyl-3-(pyrrolidin...)
Show SMILES Cc1ccc(cc1S(=O)(=O)N1CCCC1)C(=O)NC1CCCCC1
Show InChI InChI=1S/C18H26N2O3S/c1-14-9-10-15(18(21)19-16-7-3-2-4-8-16)13-17(14)24(22,23)20-11-5-6-12-20/h9-10,13,16H,2-8,11-12H2,1H3,(H,19,21)
Reactome pathway
n/an/an/an/a 21n/an/an/an/a
Evotec (UK) Ltd.
Curated by ChEMBL
Assay Description
Agonist activity at human CB2 receptor expressed in CHO cells assessed as inhibition of forskolin-stimulated cAMP level
Bioorg Med Chem Lett 18: 1725-9 (2008)
Article DOI: 10.1016/j.bmcl.2008.01.042
BindingDB Entry DOI: 10.7270/Q2X92B1F