null
SMILES: Cc1ccc(cc1S(=O)(=O)N1CCSCC1)C(=O)N1CCC2CCCCC2C1
InChI Key: InChIKey=OATYLTNFHNGZCS-UHFFFAOYSA-N
Activity Spreadsheet -- Enzyme Inhibition Constant Data from BindingDB
Found 1 hit for monomerid = 50234386
Trg + Lig
Ki
nM
ΔG°
kcal/mole
IC50
nM
Kd
nM
EC50/IC50
nM
koff
s-1
kon
M-1s-1
pHTemp
°C
Cannabinoid receptor 2
(Homo sapiens (Human))
BDBM50234386
((4-methyl-3-(thiomorpholinosulfonyl)phenyl)(octahy...)
Show SMILES Cc1ccc(cc1S(=O)(=O)N1CCSCC1)C(=O)N1CCC2CCCCC2C1 |w:21.22,26.29|
Show InChI InChI=1S/C21H30N2O3S2/c1-16-6-7-18(14-20(16)28(25,26)23-10-12-27-13-11-23)21(24)22-9-8-17-4-2-3-5-19(17)15-22/h6-7,14,17,19H,2-5,8-13,15H2,1H3
Reactome pathway
n/an/an/an/a 1n/an/an/an/a
Evotec (UK) Ltd.
Curated by ChEMBL
Assay Description
Agonist activity at human CB2 receptor expressed in CHO cells assessed as inhibition of forskolin-stimulated cAMP level
Bioorg Med Chem Lett 18: 1725-9 (2008)
Article DOI: 10.1016/j.bmcl.2008.01.042
BindingDB Entry DOI: 10.7270/Q2X92B1F