null
SMILES: Clc1ccc(cc1S(=O)(=O)N1CCCC1)C(=O)N1CCC2CCCCC2C1
InChI Key: InChIKey=DIZIUMQHNNQQSK-UHFFFAOYSA-N
Activity Spreadsheet -- Enzyme Inhibition Constant Data from BindingDB
Found 1 hit for monomerid = 50234407
Trg + Lig
Ki
nM
ΔG°
kcal/mole
IC50
nM
Kd
nM
EC50/IC50
nM
koff
s-1
kon
M-1s-1
pHTemp
°C
Cannabinoid receptor 2
(Homo sapiens (Human))
BDBM50234407
((4-chloro-3-(pyrrolidin-1-ylsulfonyl)phenyl)(octah...)
Show SMILES Clc1ccc(cc1S(=O)(=O)N1CCCC1)C(=O)N1CCC2CCCCC2C1 |w:20.21,25.28|
Show InChI InChI=1S/C20H27ClN2O3S/c21-18-8-7-16(13-19(18)27(25,26)23-10-3-4-11-23)20(24)22-12-9-15-5-1-2-6-17(15)14-22/h7-8,13,15,17H,1-6,9-12,14H2
Reactome pathway
n/an/an/an/a 4n/an/an/an/a
Evotec (UK) Ltd.
Curated by ChEMBL
Assay Description
Agonist activity at human CB2 receptor expressed in CHO cells assessed as inhibition of forskolin-stimulated cAMP level
Bioorg Med Chem Lett 18: 1725-9 (2008)
Article DOI: 10.1016/j.bmcl.2008.01.042
BindingDB Entry DOI: 10.7270/Q2X92B1F