BDBM50234732 (2,6-dimethylphenyl)(4-methyl-4-(4-(phenyl(pyridin-3-yl)amino)piperidin-1-yl)piperidin-1-yl)methanone::CHEMBL255429
SMILES: Cc1cccc(C)c1C(=O)N1CCC(C)(CC1)N1CCC(CC1)N(c1ccccc1)c1cccnc1
InChI Key: InChIKey=ZGCPJKJWPQSVFG-UHFFFAOYSA-N
Data: 2 IC50
Activity Spreadsheet -- Enzyme Inhibition Constant Data from BindingDB
Found 2 hits for monomerid = 50234732
Trg + Lig
Ki
nM
ΔG°
kcal/mole
IC50
nM
Kd
nM
EC50/IC50
nM
koff
s-1
kon
M-1s-1
pHTemp
°C
C-C chemokine receptor type 5
(Macaca fascicularis)
BDBM50234732
((2,6-dimethylphenyl)(4-methyl-4-(4-(phenyl(pyridin...)
Show SMILES Cc1cccc(C)c1C(=O)N1CCC(C)(CC1)N1CCC(CC1)N(c1ccccc1)c1cccnc1
Show InChI InChI=1S/C31H38N4O/c1-24-9-7-10-25(2)29(24)30(36)33-21-16-31(3,17-22-33)34-19-14-27(15-20-34)35(26-11-5-4-6-12-26)28-13-8-18-32-23-28/h4-13,18,23,27H,14-17,19-22H2,1-3H3
n/an/a 1.10n/an/an/an/an/an/a
Novartis Institutes for BioMedical Research
Curated by ChEMBL
Assay Description
Displacement of radiolabeled MIP-1alpha from cynomolgus monkey CCR5 expressed in CHO cells
Bioorg Med Chem Lett 18: 2000-5 (2008)
Article DOI: 10.1016/j.bmcl.2008.01.108
BindingDB Entry DOI: 10.7270/Q2NC6229
C-C chemokine receptor type 5
(Homo sapiens (Human))
BDBM50234732
((2,6-dimethylphenyl)(4-methyl-4-(4-(phenyl(pyridin...)
Show SMILES Cc1cccc(C)c1C(=O)N1CCC(C)(CC1)N1CCC(CC1)N(c1ccccc1)c1cccnc1
Show InChI InChI=1S/C31H38N4O/c1-24-9-7-10-25(2)29(24)30(36)33-21-16-31(3,17-22-33)34-19-14-27(15-20-34)35(26-11-5-4-6-12-26)28-13-8-18-32-23-28/h4-13,18,23,27H,14-17,19-22H2,1-3H3
n/an/a 0.5n/an/an/an/an/an/a
Novartis Institutes for BioMedical Research
Curated by ChEMBL
Assay Description
Displacement of [125I]RANTES from human CCR5 expressed in CHO cells
Bioorg Med Chem Lett 18: 2000-5 (2008)
Article DOI: 10.1016/j.bmcl.2008.01.108
BindingDB Entry DOI: 10.7270/Q2NC6229