BDBM50234889 CHEMBL4062023
SMILES: CSc1nc(c([nH]1)-c1ccnc(Nc2ccc(NC(=O)c3cccc(NC(=O)C=C)c3)cc2)c1)-c1ccc(F)cc1
InChI Key: InChIKey=FDNUPMASTHASFG-UHFFFAOYSA-N
Data: 2 IC50
Activity Spreadsheet -- Enzyme Inhibition Constant Data from BindingDB
Found 2 hits for monomerid = 50234889
Trg + Lig
Ki
nM
ΔG°
kcal/mole
IC50
nM
Kd
nM
EC50/IC50
nM
koff
s-1
kon
M-1s-1
pHTemp
°C
Mitogen-activated protein kinase 10
(Homo sapiens (Human))
BDBM50234889
(CHEMBL4062023)
Show SMILES CSc1nc(c([nH]1)-c1ccnc(Nc2ccc(NC(=O)c3cccc(NC(=O)C=C)c3)cc2)c1)-c1ccc(F)cc1
Show InChI InChI=1S/C31H25FN6O2S/c1-3-27(39)35-25-6-4-5-21(17-25)30(40)36-24-13-11-23(12-14-24)34-26-18-20(15-16-33-26)29-28(37-31(38-29)41-2)19-7-9-22(32)10-8-19/h3-18H,1H2,2H3,(H,33,34)(H,35,39)(H,36,40)(H,37,38)
NCI pathway
Reactome pathway
n/an/a 0.600n/an/an/an/an/an/a
Eberhard Karls Universit£t T£bingen
Curated by ChEMBL
Assay Description
Inhibition of recombinant 6x-His-tagged JNK3 (39 to 402 residues) (unknown origin) expressed in Escherichia coli BL21(DE3) assessed as reduction in A...
J Med Chem 60: 594-607 (2017)
BindingDB Entry DOI: 10.7270/Q2891854
Mitogen-activated protein kinase 14
(Homo sapiens (Human))
BDBM50234889
(CHEMBL4062023)
Show SMILES CSc1nc(c([nH]1)-c1ccnc(Nc2ccc(NC(=O)c3cccc(NC(=O)C=C)c3)cc2)c1)-c1ccc(F)cc1
Show InChI InChI=1S/C31H25FN6O2S/c1-3-27(39)35-25-6-4-5-21(17-25)30(40)36-24-13-11-23(12-14-24)34-26-18-20(15-16-33-26)29-28(37-31(38-29)41-2)19-7-9-22(32)10-8-19/h3-18H,1H2,2H3,(H,33,34)(H,35,39)(H,36,40)(H,37,38)
NCI pathway
Reactome pathway
n/an/a 0.800n/an/an/an/an/an/a
Eberhard Karls Universit£t T£bingen
Curated by ChEMBL
Assay Description
Inhibition of GST-His tagged human p38alpha expressed in Escherichia coli assessed as reduction in ATF2 phosphorylation measured after 60 mins by ELI...
J Med Chem 60: 594-607 (2017)
BindingDB Entry DOI: 10.7270/Q2891854