BDBM50234929 CHEMBL4091717
SMILES: CN1CCC(C1)Nc1cnn(C)c(=O)c1Cl
InChI Key: InChIKey=NLASRWBIBRTOBX-UHFFFAOYSA-N
Data: 1 IC50
Activity Spreadsheet -- Enzyme Inhibition Constant Data from BindingDB
Found 1 hit for monomerid = 50234929
Trg + Lig
Ki
nM
ΔG°
kcal/mole
IC50
nM
Kd
nM
EC50/IC50
nM
koff
s-1
kon
M-1s-1
pHTemp
°C
Histone acetyltransferase KAT2A/KAT2B
(Homo sapiens (Human))
BDBM50234929
(CHEMBL4091717)
Show SMILES CN1CCC(C1)Nc1cnn(C)c(=O)c1Cl
Show InChI InChI=1S/C10H15ClN4O/c1-14-4-3-7(6-14)13-8-5-12-15(2)10(16)9(8)11/h5,7,13H,3-4,6H2,1-2H3
NCI pathway
Reactome pathway
n/an/a 1.58E+4n/an/an/an/an/an/a
GlaxoSmithKline
Curated by ChEMBL
Assay Description
Displacement of GSK3103956A from FLAG-6 His-Halo tagged human PCAF bromodomain (715 to 831 residues) incubated for 30 mins in dark by TR-FRET assay
J Med Chem 60: 695-709 (2017)
BindingDB Entry DOI: 10.7270/Q2W09863