BDBM50234966 CHEMBL4061262
SMILES: CC(C)(C)CNC(=O)C[C@H](NC(=O)N1CCC(CC1)C(=O)Nc1cnccn1)C(=O)N[C@@H](CCc1ccccc1)C(=O)NCc1ccccc1Cl
InChI Key: InChIKey=LPJACRRWVCRNRH-KYJUHHDHSA-N
Data: 1 IC50
Activity Spreadsheet -- Enzyme Inhibition Constant Data from BindingDB
Found 1 hit for monomerid = 50234966
Trg + Lig
Ki
nM
ΔG°
kcal/mole
IC50
nM
Kd
nM
EC50/IC50
nM
koff
s-1
kon
M-1s-1
pHTemp
°C
20S proteasome chymotrypsin-like
(Homo sapiens (Human))
BDBM50234966
(CHEMBL4061262)
Show SMILES CC(C)(C)CNC(=O)C[C@H](NC(=O)N1CCC(CC1)C(=O)Nc1cnccn1)C(=O)N[C@@H](CCc1ccccc1)C(=O)NCc1ccccc1Cl |r|
Show InChI InChI=1S/C37H47ClN8O5/c1-37(2,3)24-42-32(47)21-30(44-36(51)46-19-15-26(16-20-46)33(48)45-31-23-39-17-18-40-31)35(50)43-29(14-13-25-9-5-4-6-10-25)34(49)41-22-27-11-7-8-12-28(27)38/h4-12,17-18,23,26,29-30H,13-16,19-22,24H2,1-3H3,(H,41,49)(H,42,47)(H,43,50)(H,44,51)(H,40,45,48)/t29-,30-/m0/s1
Reactome pathway
n/an/a 0.600n/an/an/an/an/an/a
Hangzhou Xixi Hospital
Curated by ChEMBL
Assay Description
Inhibition of chymotrypsin-like activity of human 20S proteasome pretreated for 15 mins followed by Suc-Leu-Leu-Val-Tyr-AMC substrate addition by flu...
Eur J Med Chem 126: 1056-1070 (2017)
Article DOI: 10.1016/j.ejmech.2016.12.034
BindingDB Entry DOI: 10.7270/Q2MK6G4X