null
SMILES: CN(C)CCn1cc(cn1)-c1ccn2c(cnc2c1)-c1ccc(C(N)=O)c(OCc2ccc(cc2)C(F)(F)F)c1
InChI Key: InChIKey=OOSGLLFJSREBMF-UHFFFAOYSA-N
Activity Spreadsheet -- Enzyme Inhibition Constant Data from BindingDB
Found 1 hit for monomerid = 50234995
Trg + Lig
Ki
nM
ΔG°
kcal/mole
IC50
nM
Kd
nM
EC50/IC50
nM
koff
s-1
kon
M-1s-1
pHTemp
°C
Serine/threonine-protein kinase Nek2
(Homo sapiens (Human))
BDBM50234995
(CHEMBL4105643)
Show SMILES CN(C)CCn1cc(cn1)-c1ccn2c(cnc2c1)-c1ccc(C(N)=O)c(OCc2ccc(cc2)C(F)(F)F)c1
Show InChI InChI=1S/C29H27F3N6O2/c1-36(2)11-12-37-17-22(15-35-37)20-9-10-38-25(16-34-27(38)14-20)21-5-8-24(28(33)39)26(13-21)40-18-19-3-6-23(7-4-19)29(30,31)32/h3-10,13-17H,11-12,18H2,1-2H3,(H2,33,39)
n/an/a 386n/an/an/an/an/an/a
East China Normal University
Curated by ChEMBL
Assay Description
Inhibition of N-terminal His6-tagged full-length recombinant human NEK2 expressed in baculovirus infected sf21 cells using biotin labelled-STK-3 subs...
Eur J Med Chem 126: 1083-1106 (2017)
Article DOI: 10.1016/j.ejmech.2016.12.026
BindingDB Entry DOI: 10.7270/Q2GT5QFN