BDBM50235402 CHEMBL4077934
SMILES: COc1ccc2nc(CNC(=O)c3ccc(cc3)-c3cnc(Nc4ccccc4)nc3OCC3CCNCC3)[nH]c2c1
InChI Key: InChIKey=ZMGDQRPQGXBNGY-UHFFFAOYSA-N
Data: 1 IC50
Activity Spreadsheet -- Enzyme Inhibition Constant Data from BindingDB
Found 1 hit for monomerid = 50235402
Trg + Lig
Ki
nM
ΔG°
kcal/mole
IC50
nM
Kd
nM
EC50/IC50
nM
koff
s-1
kon
M-1s-1
pHTemp
°C
Maternal embryonic leucine zipper kinase
(Homo sapiens (Human))
BDBM50235402
(CHEMBL4077934)
Show SMILES COc1ccc2nc(CNC(=O)c3ccc(cc3)-c3cnc(Nc4ccccc4)nc3OCC3CCNCC3)[nH]c2c1
Show InChI InChI=1S/C32H33N7O3/c1-41-25-11-12-27-28(17-25)38-29(37-27)19-34-30(40)23-9-7-22(8-10-23)26-18-35-32(36-24-5-3-2-4-6-24)39-31(26)42-20-21-13-15-33-16-14-21/h2-12,17-18,21,33H,13-16,19-20H2,1H3,(H,34,40)(H,37,38)(H,35,36,39)
n/an/a 0.150n/an/an/an/an/an/a
Novartis Institutes for BioMedical Research
Curated by ChEMBL
Assay Description
Inhibition of MELK (unknown origin) containing kinase domain and UBA domain using STK S1 as substrate after 20 mins by HTRF assay
J Med Chem 60: 2155-2161 (2017)
Article DOI: 10.1021/acs.jmedchem.7b00033
BindingDB Entry DOI: 10.7270/Q2MC928T