BDBM50235472 CHEMBL4063665
SMILES: Cc1ccc(cc1F)-c1cc2c(NC(Cc3cccc(F)c3)P(O)(O)=O)ncnc2s1
InChI Key: InChIKey=XUZDDINOBVMMNV-UHFFFAOYSA-N
Data: 1 IC50
Activity Spreadsheet -- Enzyme Inhibition Constant Data from BindingDB
Found 1 hit for monomerid = 50235472
Trg + Lig
Ki
nM
ΔG°
kcal/mole
IC50
nM
Kd
nM
EC50/IC50
nM
koff
s-1
kon
M-1s-1
pHTemp
°C
Farnesyl diphosphate synthase
(Homo sapiens (Human))
BDBM50235472
(CHEMBL4063665)
Show SMILES Cc1ccc(cc1F)-c1cc2c(NC(Cc3cccc(F)c3)P(O)(O)=O)ncnc2s1
Show InChI InChI=1S/C21H18F2N3O3PS/c1-12-5-6-14(9-17(12)23)18-10-16-20(24-11-25-21(16)31-18)26-19(30(27,28)29)8-13-3-2-4-15(22)7-13/h2-7,9-11,19H,8H2,1H3,(H,24,25,26)(H2,27,28,29)
Reactome pathway
n/an/a 1.50E+3n/an/an/an/an/an/a
McGill University
Curated by ChEMBL
Assay Description
Inhibition of N-terminal His-tagged human recombinant FPPS expressed in Escherichia coli BL21 (DE3) using GPP and [3H]-IPP as substrate preincubated ...
J Med Chem 60: 2119-2134 (2017)
Article DOI: 10.1021/acs.jmedchem.6b01888
BindingDB Entry DOI: 10.7270/Q23F4RXR