BDBM50235643 CHEMBL4076017
SMILES: CN(C)[C@H]1CN(C[C@@H]1C1CCN(CC1)c1ccc(cn1)C(N)=O)C1CCc2cccc(F)c12
InChI Key: InChIKey=NJCVMTGRSCLQAB-FQXDTITESA-N
Data: 1 KI  2 IC50
Activity Spreadsheet -- Enzyme Inhibition Constant Data from BindingDB
Found 3 hits for monomerid = 50235643
Trg + Lig
Ki
nM
ΔG°
kcal/mole
IC50
nM
Kd
nM
EC50/IC50
nM
koff
s-1
kon
M-1s-1
pHTemp
°C
Polycomb protein EED (EED)
(Homo sapiens (Human))
BDBM50235643
(CHEMBL4076017)
Show SMILES CN(C)[C@H]1CN(C[C@@H]1C1CCN(CC1)c1ccc(cn1)C(N)=O)C1CCc2cccc(F)c12 |r|
Show InChI InChI=1S/C26H34FN5O/c1-30(2)23-16-32(22-8-6-18-4-3-5-21(27)25(18)22)15-20(23)17-10-12-31(13-11-17)24-9-7-19(14-29-24)26(28)33/h3-5,7,9,14,17,20,22-23H,6,8,10-13,15-16H2,1-2H3,(H2,28,33)/t20-,22?,23+/m1/s1
0.450n/an/an/an/an/an/an/an/a
AbbVie Inc.
Curated by ChEMBL
Assay Description
In vitro displacement of [3H]-LY 278584 from rat cerebral cortex 5-hydroxytryptamine 3 receptor
Bioorg Med Chem Lett 27: 1576-1583 (2017)
Article DOI: 10.1016/j.bmcl.2017.02.030
BindingDB Entry DOI: 10.7270/Q22F7QQG
Polycomb protein EED (EED)
(Homo sapiens (Human))
BDBM50235643
(CHEMBL4076017)
Show SMILES CN(C)[C@H]1CN(C[C@@H]1C1CCN(CC1)c1ccc(cn1)C(N)=O)C1CCc2cccc(F)c12 |r|
Show InChI InChI=1S/C26H34FN5O/c1-30(2)23-16-32(22-8-6-18-4-3-5-21(27)25(18)22)15-20(23)17-10-12-31(13-11-17)24-9-7-19(14-29-24)26(28)33/h3-5,7,9,14,17,20,22-23H,6,8,10-13,15-16H2,1-2H3,(H2,28,33)/t20-,22?,23+/m1/s1
n/an/a 230n/an/an/an/an/an/a
AbbVie Inc.
Curated by ChEMBL
Assay Description
Inhibition of EED in human G401 cells assessed as reduction in H3K27 trymethylation measured after 6 days by alphaLISA method
Bioorg Med Chem Lett 27: 1576-1583 (2017)
Article DOI: 10.1016/j.bmcl.2017.02.030
BindingDB Entry DOI: 10.7270/Q22F7QQG
Polycomb protein EED (EED)
(Homo sapiens (Human))
BDBM50235643
(CHEMBL4076017)
Show SMILES CN(C)[C@H]1CN(C[C@@H]1C1CCN(CC1)c1ccc(cn1)C(N)=O)C1CCc2cccc(F)c12 |r|
Show InChI InChI=1S/C26H34FN5O/c1-30(2)23-16-32(22-8-6-18-4-3-5-21(27)25(18)22)15-20(23)17-10-12-31(13-11-17)24-9-7-19(14-29-24)26(28)33/h3-5,7,9,14,17,20,22-23H,6,8,10-13,15-16H2,1-2H3,(H2,28,33)/t20-,22?,23+/m1/s1
n/an/a 280n/an/an/an/an/an/a
AbbVie Inc.
Curated by ChEMBL
Assay Description
In vitro inhibition of neutral endopeptidase from rat kidney.
Bioorg Med Chem Lett 27: 1576-1583 (2017)
Article DOI: 10.1016/j.bmcl.2017.02.030
BindingDB Entry DOI: 10.7270/Q22F7QQG