BDBM50235807 CHEMBL4088289
SMILES: CN(C)C(=O)Oc1cc(OC(=O)N(C)C)cc(c1)C(O)CNc1ccc(I)cc1
InChI Key: InChIKey=OFEANRIJQRZOIX-UHFFFAOYSA-N
Data: 2 IC50
Activity Spreadsheet -- Enzyme Inhibition Constant Data from BindingDB
Found 2 hits for monomerid = 50235807
Trg + Lig
Ki
nM
ΔG°
kcal/mole
IC50
nM
Kd
nM
EC50/IC50
nM
koff
s-1
kon
M-1s-1
pHTemp
°C
Cholinesterase
(Equus caballus (Horse))
BDBM50235807
(CHEMBL4088289)
Show SMILES CN(C)C(=O)Oc1cc(OC(=O)N(C)C)cc(c1)C(O)CNc1ccc(I)cc1
Show InChI InChI=1S/C20H24IN3O5/c1-23(2)19(26)28-16-9-13(10-17(11-16)29-20(27)24(3)4)18(25)12-22-15-7-5-14(21)6-8-15/h5-11,18,22,25H,12H2,1-4H3
n/an/a 4.70E+3n/an/an/an/an/an/a
South China University of Technology
Curated by ChEMBL
Assay Description
Inhibitory concentration against cyclin dependent kinase-2 (CDK2)/Cyclin E
Eur J Med Chem 126: 61-71 (2017)
Article DOI: 10.1016/j.ejmech.2016.08.061
BindingDB Entry DOI: 10.7270/Q2571F8X
Acetylcholinesterase
(Electrophorus electricus (Electric eel))
BDBM50235807
(CHEMBL4088289)
Show SMILES CN(C)C(=O)Oc1cc(OC(=O)N(C)C)cc(c1)C(O)CNc1ccc(I)cc1
Show InChI InChI=1S/C20H24IN3O5/c1-23(2)19(26)28-16-9-13(10-17(11-16)29-20(27)24(3)4)18(25)12-22-15-7-5-14(21)6-8-15/h5-11,18,22,25H,12H2,1-4H3
n/an/a>1.00E+5n/an/an/an/an/an/a
South China University of Technology
Curated by ChEMBL
Assay Description
Tested for its ability to compete with [125I]C5a for binding to C5a anaphylatoxin chemotactic receptor of human neutrophil membrane preparations
Eur J Med Chem 126: 61-71 (2017)
Article DOI: 10.1016/j.ejmech.2016.08.061
BindingDB Entry DOI: 10.7270/Q2571F8X