BDBM50235827 CHEMBL4081974
SMILES: COC(=O)N[C@@H]1CC(C)(C)c2ccc(Nc3nc(NCC(F)F)c4occc4n3)cc2NC1=O
InChI Key: InChIKey=FIPLZUDZTBBURI-OAHLLOKOSA-N
Data: 2 IC50  1 EC50
Activity Spreadsheet -- Enzyme Inhibition Constant Data from BindingDB
Found 3 hits for monomerid = 50235827
Trg + Lig
Ki
nM
ΔG°
kcal/mole
IC50
nM
Kd
nM
EC50/IC50
nM
koff
s-1
kon
M-1s-1
pHTemp
°C
Potassium voltage-gated channel subfamily H member 2
(Homo sapiens (Human))
BDBM50235827
(CHEMBL4081974)
Show SMILES COC(=O)N[C@@H]1CC(C)(C)c2ccc(Nc3nc(NCC(F)F)c4occc4n3)cc2NC1=O |r|
Show InChI InChI=1S/C22H24F2N6O4/c1-22(2)9-15(29-21(32)33-3)19(31)27-14-8-11(4-5-12(14)22)26-20-28-13-6-7-34-17(13)18(30-20)25-10-16(23)24/h4-8,15-16H,9-10H2,1-3H3,(H,27,31)(H,29,32)(H2,25,26,28,30)/t15-/m1/s1
Reactome pathway
n/an/a>2.00E+4n/an/an/an/an/an/a
AbbVie Bioresearch Center
Curated by ChEMBL
Assay Description
Inhibitory concentration against cyclin dependent kinase-2 (CDK2)/Cyclin E
Bioorg Med Chem Lett 26: 5562-5567 (2016)
Article DOI: 10.1016/j.bmcl.2016.09.077
BindingDB Entry DOI: 10.7270/Q2WQ061V
Tyrosine-protein kinase SYK
(Homo sapiens (Human))
BDBM50235827
(CHEMBL4081974)
Show SMILES COC(=O)N[C@@H]1CC(C)(C)c2ccc(Nc3nc(NCC(F)F)c4occc4n3)cc2NC1=O |r|
Show InChI InChI=1S/C22H24F2N6O4/c1-22(2)9-15(29-21(32)33-3)19(31)27-14-8-11(4-5-12(14)22)26-20-28-13-6-7-34-17(13)18(30-20)25-10-16(23)24/h4-8,15-16H,9-10H2,1-3H3,(H,27,31)(H,29,32)(H2,25,26,28,30)/t15-/m1/s1
NCI pathway
Reactome pathway
n/an/a 20n/an/an/an/an/an/a
AbbVie Bioresearch Center
Curated by ChEMBL
Assay Description
Inhibitory concentration required against 5-lipoxygenase activity in cytosolic fractions of human neutrophils
Bioorg Med Chem Lett 26: 5562-5567 (2016)
Article DOI: 10.1016/j.bmcl.2016.09.077
BindingDB Entry DOI: 10.7270/Q2WQ061V
Tyrosine-protein kinase SYK
(Homo sapiens (Human))
BDBM50235827
(CHEMBL4081974)
Show SMILES COC(=O)N[C@@H]1CC(C)(C)c2ccc(Nc3nc(NCC(F)F)c4occc4n3)cc2NC1=O |r|
Show InChI InChI=1S/C22H24F2N6O4/c1-22(2)9-15(29-21(32)33-3)19(31)27-14-8-11(4-5-12(14)22)26-20-28-13-6-7-34-17(13)18(30-20)25-10-16(23)24/h4-8,15-16H,9-10H2,1-3H3,(H,27,31)(H,29,32)(H2,25,26,28,30)/t15-/m1/s1
NCI pathway
Reactome pathway
n/an/an/an/a 26n/an/an/an/a
AbbVie Bioresearch Center
Curated by ChEMBL
Assay Description
Inhibitory concentration against cyclin dependent kinase-2 (CDK2)/Cyclin E
Bioorg Med Chem Lett 26: 5562-5567 (2016)
Article DOI: 10.1016/j.bmcl.2016.09.077
BindingDB Entry DOI: 10.7270/Q2WQ061V