BDBM50235994 CHEMBL4063655
SMILES: N#Cc1ccc2nncn2c1NCc1ccco1
InChI Key: InChIKey=HNQBUBGQBZCBSB-UHFFFAOYSA-N
Data: 1 IC50
PDB links: 1 PDB ID matches this monomer.
Activity Spreadsheet -- Enzyme Inhibition Constant Data from BindingDB
Found 1 hit for monomerid = 50235994
Trg + Lig
Ki
nM
ΔG°
kcal/mole
IC50
nM
Kd
nM
EC50/IC50
nM
koff
s-1
kon
M-1s-1
pHTemp
°C
Polycomb protein EED
(Homo sapiens (Human))
BDBM50235994
(CHEMBL4063655)
Show SMILES N#Cc1ccc2nncn2c1NCc1ccco1
Show InChI InChI=1S/C12H9N5O/c13-6-9-3-4-11-16-15-8-17(11)12(9)14-7-10-2-1-5-18-10/h1-5,8,14H,7H2
n/an/a 1.00E+3n/an/an/an/an/an/a
Novartis Institutes for BioMedical Research
Curated by ChEMBL
Assay Description
Inhibition of EED in human G401 cells assessed as reduction in global H3K27me3 level after 48 hrs by ELISA
J Med Chem 60: 2215-2226 (2017)
Article DOI: 10.1021/acs.jmedchem.6b01576
BindingDB Entry DOI: 10.7270/Q20G3NDT
3D
3D Structure (crystal)