BDBM50236120 CHEMBL4078004
SMILES: c1ccc(nc1)-c1nnc2sc(nn12)-c1cccnc1
InChI Key: InChIKey=OWJPMUJWYVCFAG-UHFFFAOYSA-N
Data: 1 IC50
Activity Spreadsheet -- Enzyme Inhibition Constant Data from BindingDB
Found 1 hit for monomerid = 50236120
Trg + Lig
Ki
nM
ΔG°
kcal/mole
IC50
nM
Kd
nM
EC50/IC50
nM
koff
s-1
kon
M-1s-1
pHTemp
°C
dCTP pyrophosphatase 1
(Homo sapiens (Human))
BDBM50236120
(CHEMBL4078004)
Show SMILES c1ccc(nc1)-c1nnc2sc(nn12)-c1cccnc1
Show InChI InChI=1S/C13H8N6S/c1-2-7-15-10(5-1)11-16-17-13-19(11)18-12(20-13)9-4-3-6-14-8-9/h1-8H
n/an/a 233n/an/an/an/an/an/a
Karolinska Institutet
Curated by ChEMBL
Assay Description
Binding affinity against 5-hydroxytryptamine 3 receptor in rat cortical membrane using [3H]GR-65630 as radioligand
J Med Chem 60: 2148-2154 (2017)
Article DOI: 10.1021/acs.jmedchem.6b01786
BindingDB Entry DOI: 10.7270/Q2BR8VGZ