BDBM50236183 (R)-4'-(2-(2-(3-chlorophenyl)-2-hydroxyethylamino)ethyl)-3-isopropoxybiphenyl-4-carboxylic acid::4'-{2-[(R)-2-(3-Chloro-phenyl)-2-hydroxy-ethylamino]-ethyl}-3-isopropoxy-biphenyl-4-carboxylic acid::4-(2-{[(2R)-2-(3-chlorophenyl)-2-hydroxyethyl]amino}ethyl)-3-isopropoxy-4-biphenyl-4-carboxylic acid::CHEMBL272584
SMILES: CC(C)Oc1cc(ccc1C(O)=O)-c1ccc(CCNC[C@H](O)c2cccc(Cl)c2)cc1
InChI Key: InChIKey=FILCWTJCNLYKQZ-DEOSSOPVSA-N
Data: 12 EC50
Activity Spreadsheet -- Enzyme Inhibition Constant Data from BindingDB
Found 12 hits for monomerid = 50236183
Trg + Lig
Ki
nM
ΔG°
kcal/mole
IC50
nM
Kd
nM
EC50/IC50
nM
koff
s-1
kon
M-1s-1
pHTemp
°C
Beta-2 adrenergic receptor
(Homo sapiens (Human))
BDBM50236183
((R)-4'-(2-(2-(3-chlorophenyl)-2-hydroxyethylamino)...)
Show SMILES CC(C)Oc1cc(ccc1C(O)=O)-c1ccc(CCNC[C@H](O)c2cccc(Cl)c2)cc1 |r|
Show InChI InChI=1S/C26H28ClNO4/c1-17(2)32-25-15-20(10-11-23(25)26(30)31)19-8-6-18(7-9-19)12-13-28-16-24(29)21-4-3-5-22(27)14-21/h3-11,14-15,17,24,28-29H,12-13,16H2,1-2H3,(H,30,31)/t24-/m0/s1
Reactome pathway
n/an/an/an/a>1.00E+4n/an/an/an/a
Astellas Pharma Inc.
Curated by ChEMBL
Assay Description
Agonist activity at human recombinant beta2 adrenergic receptor expressed in CHO cells assessed as cAMP accumulation by enzyme immuno assay
J Med Chem 51: 4002-20 (2008)
Article DOI: 10.1021/jm8000345
BindingDB Entry DOI: 10.7270/Q2MS3SKD
Beta-2 adrenergic receptor
(Homo sapiens (Human))
BDBM50236183
((R)-4'-(2-(2-(3-chlorophenyl)-2-hydroxyethylamino)...)
Show SMILES CC(C)Oc1cc(ccc1C(O)=O)-c1ccc(CCNC[C@H](O)c2cccc(Cl)c2)cc1 |r|
Show InChI InChI=1S/C26H28ClNO4/c1-17(2)32-25-15-20(10-11-23(25)26(30)31)19-8-6-18(7-9-19)12-13-28-16-24(29)21-4-3-5-22(27)14-21/h3-11,14-15,17,24,28-29H,12-13,16H2,1-2H3,(H,30,31)/t24-/m0/s1
Reactome pathway
n/an/an/an/a>1.00E+3n/an/an/an/a
Astellas Pharma Inc.
Curated by ChEMBL
Assay Description
Agonist activity at human recombinant beta2 adrenergic receptor expressed in CHO cells assessed as cAMP accumulation by enzyme immunoassay
J Med Chem 52: 3063-72 (2009)
Article DOI: 10.1021/jm9000709
BindingDB Entry DOI: 10.7270/Q2S75G6J
Beta-2 adrenergic receptor
(Homo sapiens (Human))
BDBM50236183
((R)-4'-(2-(2-(3-chlorophenyl)-2-hydroxyethylamino)...)
Show SMILES CC(C)Oc1cc(ccc1C(O)=O)-c1ccc(CCNC[C@H](O)c2cccc(Cl)c2)cc1 |r|
Show InChI InChI=1S/C26H28ClNO4/c1-17(2)32-25-15-20(10-11-23(25)26(30)31)19-8-6-18(7-9-19)12-13-28-16-24(29)21-4-3-5-22(27)14-21/h3-11,14-15,17,24,28-29H,12-13,16H2,1-2H3,(H,30,31)/t24-/m0/s1
Reactome pathway
n/an/an/an/a>1.00E+3n/an/an/an/a
Astellas Pharma Inc.
Curated by ChEMBL
Assay Description
Agonist activity at human beta2 adrenergic receptor expressed in CHO cells assessed as cAMP accumulation by EIA
J Med Chem 51: 1925-44 (2008)
Article DOI: 10.1021/jm701324c
BindingDB Entry DOI: 10.7270/Q24X58PB
Beta-3 adrenergic receptor
(Homo sapiens (Human))
BDBM50236183
((R)-4'-(2-(2-(3-chlorophenyl)-2-hydroxyethylamino)...)
Show SMILES CC(C)Oc1cc(ccc1C(O)=O)-c1ccc(CCNC[C@H](O)c2cccc(Cl)c2)cc1 |r|
Show InChI InChI=1S/C26H28ClNO4/c1-17(2)32-25-15-20(10-11-23(25)26(30)31)19-8-6-18(7-9-19)12-13-28-16-24(29)21-4-3-5-22(27)14-21/h3-11,14-15,17,24,28-29H,12-13,16H2,1-2H3,(H,30,31)/t24-/m0/s1
Reactome pathway
n/an/an/an/a 1.10n/an/an/an/a
Astellas Pharma Inc.
Curated by ChEMBL
Assay Description
Agonist activity at human recombinant beta3 adrenergic receptor expressed in CHO cells assessed as cAMP accumulation by enzyme immuno assay
J Med Chem 51: 4002-20 (2008)
Article DOI: 10.1021/jm8000345
BindingDB Entry DOI: 10.7270/Q2MS3SKD
Beta-1 adrenergic receptor
(Homo sapiens (Human))
BDBM50236183
((R)-4'-(2-(2-(3-chlorophenyl)-2-hydroxyethylamino)...)
Show SMILES CC(C)Oc1cc(ccc1C(O)=O)-c1ccc(CCNC[C@H](O)c2cccc(Cl)c2)cc1 |r|
Show InChI InChI=1S/C26H28ClNO4/c1-17(2)32-25-15-20(10-11-23(25)26(30)31)19-8-6-18(7-9-19)12-13-28-16-24(29)21-4-3-5-22(27)14-21/h3-11,14-15,17,24,28-29H,12-13,16H2,1-2H3,(H,30,31)/t24-/m0/s1
Reactome pathway
n/an/an/an/a 720n/an/an/an/a
Astellas Pharma Inc.
Curated by ChEMBL
Assay Description
Agonist activity at human recombinant beta-1 adrenergic receptor expressed in CHO cells assessed as cAMP accumulation by enzyme immuno assay
J Med Chem 51: 4002-20 (2008)
Article DOI: 10.1021/jm8000345
BindingDB Entry DOI: 10.7270/Q2MS3SKD
Beta-1 adrenergic receptor
(Homo sapiens (Human))
BDBM50236183
((R)-4'-(2-(2-(3-chlorophenyl)-2-hydroxyethylamino)...)
Show SMILES CC(C)Oc1cc(ccc1C(O)=O)-c1ccc(CCNC[C@H](O)c2cccc(Cl)c2)cc1 |r|
Show InChI InChI=1S/C26H28ClNO4/c1-17(2)32-25-15-20(10-11-23(25)26(30)31)19-8-6-18(7-9-19)12-13-28-16-24(29)21-4-3-5-22(27)14-21/h3-11,14-15,17,24,28-29H,12-13,16H2,1-2H3,(H,30,31)/t24-/m0/s1
Reactome pathway
n/an/an/an/a 720n/an/an/an/a
Astellas Pharma Inc.
Curated by ChEMBL
Assay Description
Agonist activity at human beta-1 adrenergic receptor expressed in CHO cells assessed as cAMP accumulation by EIA
J Med Chem 51: 1925-44 (2008)
Article DOI: 10.1021/jm701324c
BindingDB Entry DOI: 10.7270/Q24X58PB
Beta-1 adrenergic receptor
(Homo sapiens (Human))
BDBM50236183
((R)-4'-(2-(2-(3-chlorophenyl)-2-hydroxyethylamino)...)
Show SMILES CC(C)Oc1cc(ccc1C(O)=O)-c1ccc(CCNC[C@H](O)c2cccc(Cl)c2)cc1 |r|
Show InChI InChI=1S/C26H28ClNO4/c1-17(2)32-25-15-20(10-11-23(25)26(30)31)19-8-6-18(7-9-19)12-13-28-16-24(29)21-4-3-5-22(27)14-21/h3-11,14-15,17,24,28-29H,12-13,16H2,1-2H3,(H,30,31)/t24-/m0/s1
Reactome pathway
n/an/an/an/a 720n/an/an/an/a
Astellas Pharma Inc.
Curated by ChEMBL
Assay Description
Agonist activity at human cloned adrenergic beta1 receptor expressed in CHO cells assessed as cAMP accumulation
Bioorg Med Chem Lett 18: 5037-40 (2008)
Article DOI: 10.1016/j.bmcl.2008.08.009
BindingDB Entry DOI: 10.7270/Q21R6QBZ
Beta-1 adrenergic receptor
(Homo sapiens (Human))
BDBM50236183
((R)-4'-(2-(2-(3-chlorophenyl)-2-hydroxyethylamino)...)
Show SMILES CC(C)Oc1cc(ccc1C(O)=O)-c1ccc(CCNC[C@H](O)c2cccc(Cl)c2)cc1 |r|
Show InChI InChI=1S/C26H28ClNO4/c1-17(2)32-25-15-20(10-11-23(25)26(30)31)19-8-6-18(7-9-19)12-13-28-16-24(29)21-4-3-5-22(27)14-21/h3-11,14-15,17,24,28-29H,12-13,16H2,1-2H3,(H,30,31)/t24-/m0/s1
Reactome pathway
n/an/an/an/a 720n/an/an/an/a
Astellas Pharma Inc.
Curated by ChEMBL
Assay Description
Agonist activity at human recombinant beta-1 adrenergic receptor expressed in CHO cells assessed as cAMP accumulation by enzyme immunoassay
J Med Chem 52: 3063-72 (2009)
Article DOI: 10.1021/jm9000709
BindingDB Entry DOI: 10.7270/Q2S75G6J
Beta-3 adrenergic receptor
(Homo sapiens (Human))
BDBM50236183
((R)-4'-(2-(2-(3-chlorophenyl)-2-hydroxyethylamino)...)
Show SMILES CC(C)Oc1cc(ccc1C(O)=O)-c1ccc(CCNC[C@H](O)c2cccc(Cl)c2)cc1 |r|
Show InChI InChI=1S/C26H28ClNO4/c1-17(2)32-25-15-20(10-11-23(25)26(30)31)19-8-6-18(7-9-19)12-13-28-16-24(29)21-4-3-5-22(27)14-21/h3-11,14-15,17,24,28-29H,12-13,16H2,1-2H3,(H,30,31)/t24-/m0/s1
Reactome pathway
n/an/an/an/a 1.10n/an/an/an/a
Astellas Pharma Inc.
Curated by ChEMBL
Assay Description
Agonist activity at human recombinant beta3 adrenergic receptor expressed in CHO cells assessed as cAMP accumulation by enzyme immunoassay
J Med Chem 52: 3063-72 (2009)
Article DOI: 10.1021/jm9000709
BindingDB Entry DOI: 10.7270/Q2S75G6J
Beta-3 adrenergic receptor
(Canis familiaris)
BDBM50236183
((R)-4'-(2-(2-(3-chlorophenyl)-2-hydroxyethylamino)...)
Show SMILES CC(C)Oc1cc(ccc1C(O)=O)-c1ccc(CCNC[C@H](O)c2cccc(Cl)c2)cc1 |r|
Show InChI InChI=1S/C26H28ClNO4/c1-17(2)32-25-15-20(10-11-23(25)26(30)31)19-8-6-18(7-9-19)12-13-28-16-24(29)21-4-3-5-22(27)14-21/h3-11,14-15,17,24,28-29H,12-13,16H2,1-2H3,(H,30,31)/t24-/m0/s1
n/an/an/an/a 1n/an/an/an/a
Astellas Pharma Inc.
Curated by ChEMBL
Assay Description
Agonist activity at dog beta3 adrenergic receptor expressed in CHO cells assessed as cAMP accumulation
J Med Chem 51: 1925-44 (2008)
Article DOI: 10.1021/jm701324c
BindingDB Entry DOI: 10.7270/Q24X58PB
Beta-3 adrenergic receptor
(Homo sapiens (Human))
BDBM50236183
((R)-4'-(2-(2-(3-chlorophenyl)-2-hydroxyethylamino)...)
Show SMILES CC(C)Oc1cc(ccc1C(O)=O)-c1ccc(CCNC[C@H](O)c2cccc(Cl)c2)cc1 |r|
Show InChI InChI=1S/C26H28ClNO4/c1-17(2)32-25-15-20(10-11-23(25)26(30)31)19-8-6-18(7-9-19)12-13-28-16-24(29)21-4-3-5-22(27)14-21/h3-11,14-15,17,24,28-29H,12-13,16H2,1-2H3,(H,30,31)/t24-/m0/s1
Reactome pathway
n/an/an/an/a 1.10n/an/an/an/a
Astellas Pharma Inc.
Curated by ChEMBL
Assay Description
Agonist activity at human beta3 adrenergic receptor expressed in CHO cells assessed as cAMP accumulation by EIA
J Med Chem 51: 1925-44 (2008)
Article DOI: 10.1021/jm701324c
BindingDB Entry DOI: 10.7270/Q24X58PB
Beta-3 adrenergic receptor
(Homo sapiens (Human))
BDBM50236183
((R)-4'-(2-(2-(3-chlorophenyl)-2-hydroxyethylamino)...)
Show SMILES CC(C)Oc1cc(ccc1C(O)=O)-c1ccc(CCNC[C@H](O)c2cccc(Cl)c2)cc1 |r|
Show InChI InChI=1S/C26H28ClNO4/c1-17(2)32-25-15-20(10-11-23(25)26(30)31)19-8-6-18(7-9-19)12-13-28-16-24(29)21-4-3-5-22(27)14-21/h3-11,14-15,17,24,28-29H,12-13,16H2,1-2H3,(H,30,31)/t24-/m0/s1
Reactome pathway
n/an/an/an/a 1.10n/an/an/an/a
Astellas Pharma Inc.
Curated by ChEMBL
Assay Description
Agonist activity at human cloned adrenergic beta3 receptor expressed in CHO cells assessed as cAMP accumulation
Bioorg Med Chem Lett 18: 5037-40 (2008)
Article DOI: 10.1016/j.bmcl.2008.08.009
BindingDB Entry DOI: 10.7270/Q21R6QBZ