BDBM50236264 19-methyl-7-[(1E)-1-[(propan-2-yloxy)imino]ethyl]-3,13,19,20-tetraazahexacyclo[14.7.0.0^{2,10}.0^{4,9}.0^{11,15}.0^{17,21}]tricosa-1(16),2(10),4,6,8,11(15),17,20-octaen-14-one::CHEMBL258000
SMILES: CC(C)O\N=C(/C)c1ccc2[nH]c3c4CCc5nn(C)cc5-c4c4C(=O)NCc4c3c2c1
InChI Key: InChIKey=ZZOUIAPNOGIDSZ-VFLNYLIXSA-N
Data: 3 IC50
Activity Spreadsheet -- Enzyme Inhibition Constant Data from BindingDB
Found 3 hits for monomerid = 50236264
Trg + Lig
Ki
nM
ΔG°
kcal/mole
IC50
nM
Kd
nM
EC50/IC50
nM
koff
s-1
kon
M-1s-1
pHTemp
°C
Vascular endothelial growth factor receptor 2
(Homo sapiens (Human))
BDBM50236264
(19-methyl-7-[(1E)-1-[(propan-2-yloxy)imino]ethyl]-...)
Show SMILES CC(C)O\N=C(/C)c1ccc2[nH]c3c4CCc5nn(C)cc5-c4c4C(=O)NCc4c3c2c1
Show InChI InChI=1S/C25H25N5O2/c1-12(2)32-29-13(3)14-5-7-19-16(9-14)22-17-10-26-25(31)23(17)21-15(24(22)27-19)6-8-20-18(21)11-30(4)28-20/h5,7,9,11-12,27H,6,8,10H2,1-4H3,(H,26,31)/b29-13+
NCI pathway
Reactome pathway
n/an/a 3n/an/an/an/an/an/a
Cephalon, Inc.
Curated by ChEMBL
Assay Description
Inhibition of human recombinant VEGFR2 by HTRF assay
Bioorg Med Chem Lett 18: 1916-21 (2008)
Article DOI: 10.1016/j.bmcl.2008.02.001
BindingDB Entry DOI: 10.7270/Q27M07PV
Vascular endothelial growth factor receptor 2
(Homo sapiens (Human))
BDBM50236264
(19-methyl-7-[(1E)-1-[(propan-2-yloxy)imino]ethyl]-...)
Show SMILES CC(C)O\N=C(/C)c1ccc2[nH]c3c4CCc5nn(C)cc5-c4c4C(=O)NCc4c3c2c1
Show InChI InChI=1S/C25H25N5O2/c1-12(2)32-29-13(3)14-5-7-19-16(9-14)22-17-10-26-25(31)23(17)21-15(24(22)27-19)6-8-20-18(21)11-30(4)28-20/h5,7,9,11-12,27H,6,8,10H2,1-4H3,(H,26,31)/b29-13+
NCI pathway
Reactome pathway
n/an/a 4n/an/an/an/an/an/a
Cephalon, Inc.
Curated by ChEMBL
Assay Description
Inhibition of VEGF-stimulated VEGFR2 autophosphorylation in HUVEC cells at 50 nM relative to control
Bioorg Med Chem Lett 18: 1916-21 (2008)
Article DOI: 10.1016/j.bmcl.2008.02.001
BindingDB Entry DOI: 10.7270/Q27M07PV
Angiopoietin-1 receptor
(Homo sapiens (Human))
BDBM50236264
(19-methyl-7-[(1E)-1-[(propan-2-yloxy)imino]ethyl]-...)
Show SMILES CC(C)O\N=C(/C)c1ccc2[nH]c3c4CCc5nn(C)cc5-c4c4C(=O)NCc4c3c2c1
Show InChI InChI=1S/C25H25N5O2/c1-12(2)32-29-13(3)14-5-7-19-16(9-14)22-17-10-26-25(31)23(17)21-15(24(22)27-19)6-8-20-18(21)11-30(4)28-20/h5,7,9,11-12,27H,6,8,10H2,1-4H3,(H,26,31)/b29-13+
n/an/a 28n/an/an/an/an/an/a
Cephalon, Inc.
Curated by ChEMBL
Assay Description
Inhibition of human recombinant TIE2 by HTRF assay
Bioorg Med Chem Lett 18: 1916-21 (2008)
Article DOI: 10.1016/j.bmcl.2008.02.001
BindingDB Entry DOI: 10.7270/Q27M07PV