null
SMILES: CCCCNS(=O)(=O)NC(=O)CCCc1c([nH]c2ccc(cc12)C#N)-c1ccc(F)cc1
InChI Key: InChIKey=OMXAYNLRGMUIBT-UHFFFAOYSA-N
Activity Spreadsheet -- Enzyme Inhibition Constant Data from BindingDB
Found 1 hit for monomerid = 50236301
Trg + Lig
Ki
nM
ΔG°
kcal/mole
IC50
nM
Kd
nM
EC50/IC50
nM
koff
s-1
kon
M-1s-1
pHTemp
°C
C-X-C chemokine receptor type 2
(Homo sapiens (Human))
BDBM50236301
(CHEMBL258038 | N-(butylsulfamoyl)-4-[5-cyano-2-(4-...)
Show SMILES CCCCNS(=O)(=O)NC(=O)CCCc1c([nH]c2ccc(cc12)C#N)-c1ccc(F)cc1
Show InChI InChI=1S/C23H25FN4O3S/c1-2-3-13-26-32(30,31)28-22(29)6-4-5-19-20-14-16(15-25)7-12-21(20)27-23(19)17-8-10-18(24)11-9-17/h7-12,14,26-27H,2-6,13H2,1H3,(H,28,29)
Reactome pathway
n/an/a 1.10E+3n/an/an/an/an/an/a
Johnson& Johnson Pharmaceutical Research and Development
Curated by ChEMBL
Assay Description
Displacement of europium labeled-human IL8 from human cloned CXCR2 expressed in Sf9 membrane with Galphai3-beta-1-gamma-2 by DELFIA binding assay
Bioorg Med Chem Lett 18: 1926-30 (2008)
Article DOI: 10.1016/j.bmcl.2008.01.127
BindingDB Entry DOI: 10.7270/Q20P10V3