BDBM50236366 CHEMBL4083038
SMILES: Cn1c(cc2sccc12)C(=O)Nc1cccc(COc2ccc(OC3CCNCC3)cc2)c1
InChI Key: InChIKey=NCKQOQVVTYHFPU-UHFFFAOYSA-N
Data: 5 IC50
Activity Spreadsheet -- Enzyme Inhibition Constant Data from BindingDB
Found 5 hits for monomerid = 50236366
Trg + Lig
Ki
nM
ΔG°
kcal/mole
IC50
nM
Kd
nM
EC50/IC50
nM
koff
s-1
kon
M-1s-1
pHTemp
°C
Amine oxidase [flavin-containing] B
(Homo sapiens (Human))
BDBM50236366
(CHEMBL4083038)
Show SMILES Cn1c(cc2sccc12)C(=O)Nc1cccc(COc2ccc(OC3CCNCC3)cc2)c1
Show InChI InChI=1S/C26H27N3O3S/c1-29-23-11-14-33-25(23)16-24(29)26(30)28-19-4-2-3-18(15-19)17-31-20-5-7-21(8-6-20)32-22-9-12-27-13-10-22/h2-8,11,14-16,22,27H,9-10,12-13,17H2,1H3,(H,28,30)
n/an/a 7.16E+3n/an/an/an/an/an/a
European Institute of Oncology
Curated by ChEMBL
Assay Description
Inhibition of recombinant human MAOB incubated for 15 mins measured after 30 mins by luminescence-Glo assay
J Med Chem 60: 1673-1692 (2017)
Article DOI: 10.1021/acs.jmedchem.6b01018
BindingDB Entry DOI: 10.7270/Q26112KN
Lysine-specific histone demethylase 1B
(Homo sapiens (Human))
BDBM50236366
(CHEMBL4083038)
Show SMILES Cn1c(cc2sccc12)C(=O)Nc1cccc(COc2ccc(OC3CCNCC3)cc2)c1
Show InChI InChI=1S/C26H27N3O3S/c1-29-23-11-14-33-25(23)16-24(29)26(30)28-19-4-2-3-18(15-19)17-31-20-5-7-21(8-6-20)32-22-9-12-27-13-10-22/h2-8,11,14-16,22,27H,9-10,12-13,17H2,1H3,(H,28,30)
Reactome pathway
n/an/a>1.00E+5n/an/an/an/an/an/a
European Institute of Oncology
Curated by ChEMBL
Assay Description
Inhibition of KDM1B (unknown origin)
J Med Chem 60: 1673-1692 (2017)
Article DOI: 10.1021/acs.jmedchem.6b01018
BindingDB Entry DOI: 10.7270/Q26112KN
Amine oxidase (flavin-containing) A
(Homo sapiens (Human))
BDBM50236366
(CHEMBL4083038)
Show SMILES Cn1c(cc2sccc12)C(=O)Nc1cccc(COc2ccc(OC3CCNCC3)cc2)c1
Show InChI InChI=1S/C26H27N3O3S/c1-29-23-11-14-33-25(23)16-24(29)26(30)28-19-4-2-3-18(15-19)17-31-20-5-7-21(8-6-20)32-22-9-12-27-13-10-22/h2-8,11,14-16,22,27H,9-10,12-13,17H2,1H3,(H,28,30)
n/an/a>1.00E+5n/an/an/an/an/an/a
European Institute of Oncology
Curated by ChEMBL
Assay Description
Inhibition of recombinant human MAOA incubated for 15 mins measured after 30 mins by luminescence-Glo assay
J Med Chem 60: 1673-1692 (2017)
Article DOI: 10.1021/acs.jmedchem.6b01018
BindingDB Entry DOI: 10.7270/Q26112KN
LSD1/CoREST complex
(Homo sapiens (Human))
BDBM50236366
(CHEMBL4083038)
Show SMILES Cn1c(cc2sccc12)C(=O)Nc1cccc(COc2ccc(OC3CCNCC3)cc2)c1
Show InChI InChI=1S/C26H27N3O3S/c1-29-23-11-14-33-25(23)16-24(29)26(30)28-19-4-2-3-18(15-19)17-31-20-5-7-21(8-6-20)32-22-9-12-27-13-10-22/h2-8,11,14-16,22,27H,9-10,12-13,17H2,1H3,(H,28,30)
n/an/a 160n/an/an/an/an/an/a
European Institute of Oncology
Curated by ChEMBL
Assay Description
Inhibition of recombinant human KDM1A/CoREST complex expressed in Escherichia coli using [Lys(Me1)4]-Histone H3 (1 to 21 residues)-GGK(biotin) as sub...
J Med Chem 60: 1693-1715 (2017)
Article DOI: 10.1021/acs.jmedchem.6b01019
BindingDB Entry DOI: 10.7270/Q22809VX
LSD1/CoREST complex
(Homo sapiens (Human))
BDBM50236366
(CHEMBL4083038)
Show SMILES Cn1c(cc2sccc12)C(=O)Nc1cccc(COc2ccc(OC3CCNCC3)cc2)c1
Show InChI InChI=1S/C26H27N3O3S/c1-29-23-11-14-33-25(23)16-24(29)26(30)28-19-4-2-3-18(15-19)17-31-20-5-7-21(8-6-20)32-22-9-12-27-13-10-22/h2-8,11,14-16,22,27H,9-10,12-13,17H2,1H3,(H,28,30)
n/an/a 160n/an/an/an/an/an/a
European Institute of Oncology
Curated by ChEMBL
Assay Description
Displacement of specific [3H]- 5-HT binding to cloned human 5-hydroxytryptamine 1A receptor stably expressed in HeLa cells
J Med Chem 60: 1673-1692 (2017)
Article DOI: 10.1021/acs.jmedchem.6b01018
BindingDB Entry DOI: 10.7270/Q26112KN