BDBM50236377 (S)-N,N-dimethyl-2-(4-(1-(thiazol-2-ylmethyl)-1H-indazol-5-ylamino)quinazolin-5-yloxy)propanamide::CHEMBL257198
SMILES: C[C@H](Oc1cccc2ncnc(Nc3ccc4n(Cc5nccs5)ncc4c3)c12)C(=O)N(C)C
InChI Key: InChIKey=FCBLJVFIYLTZPQ-HNNXBMFYSA-N
Data: 1 IC50
Activity Spreadsheet -- Enzyme Inhibition Constant Data from BindingDB
Found 1 hit for monomerid = 50236377
Trg + Lig
Ki
nM
ΔG°
kcal/mole
IC50
nM
Kd
nM
EC50/IC50
nM
koff
s-1
kon
M-1s-1
pHTemp
°C
Receptor tyrosine-protein kinase erbB-2
(Homo sapiens (Human))
BDBM50236377
((S)-N,N-dimethyl-2-(4-(1-(thiazol-2-ylmethyl)-1H-i...)
Show SMILES C[C@H](Oc1cccc2ncnc(Nc3ccc4n(Cc5nccs5)ncc4c3)c12)C(=O)N(C)C
Show InChI InChI=1S/C24H23N7O2S/c1-15(24(32)30(2)3)33-20-6-4-5-18-22(20)23(27-14-26-18)29-17-7-8-19-16(11-17)12-28-31(19)13-21-25-9-10-34-21/h4-12,14-15H,13H2,1-3H3,(H,26,27,29)/t15-/m0/s1
n/an/a 24n/an/an/an/an/an/a
Centre de Recherches
Curated by ChEMBL
Assay Description
Inhibition of human erbB2 autophosphorylation in MCF7 cells
Bioorg Med Chem Lett 18: 1799-803 (2008)
Article DOI: 10.1016/j.bmcl.2008.02.035
BindingDB Entry DOI: 10.7270/Q23T9H0F