BDBM50236379 (R)-2-(4-(1-(thiazol-4-ylmethyl)-1H-indazol-5-ylamino)quinazolin-5-yloxy)propanamide::CHEMBL257196
SMILES: C[C@@H](Oc1cccc2ncnc(Nc3ccc4n(Cc5cscn5)ncc4c3)c12)C(N)=O
InChI Key: InChIKey=RVVGPIUUCSXRDL-CYBMUJFWSA-N
Data: 1 IC50
Activity Spreadsheet -- Enzyme Inhibition Constant Data from BindingDB
Found 1 hit for monomerid = 50236379
Trg + Lig
Ki
nM
ΔG°
kcal/mole
IC50
nM
Kd
nM
EC50/IC50
nM
koff
s-1
kon
M-1s-1
pHTemp
°C
Receptor tyrosine-protein kinase erbB-2
(Homo sapiens (Human))
BDBM50236379
((R)-2-(4-(1-(thiazol-4-ylmethyl)-1H-indazol-5-ylam...)
Show SMILES C[C@@H](Oc1cccc2ncnc(Nc3ccc4n(Cc5cscn5)ncc4c3)c12)C(N)=O
Show InChI InChI=1S/C22H19N7O2S/c1-13(21(23)30)31-19-4-2-3-17-20(19)22(25-11-24-17)28-15-5-6-18-14(7-15)8-27-29(18)9-16-10-32-12-26-16/h2-8,10-13H,9H2,1H3,(H2,23,30)(H,24,25,28)/t13-/m1/s1
n/an/a 140n/an/an/an/an/an/a
Centre de Recherches
Curated by ChEMBL
Assay Description
Inhibition of human erbB2 autophosphorylation in MCF7 cells
Bioorg Med Chem Lett 18: 1799-803 (2008)
Article DOI: 10.1016/j.bmcl.2008.02.035
BindingDB Entry DOI: 10.7270/Q23T9H0F