BDBM50236444 CHEMBL4090812
SMILES: CCOCc1cccc(NC(=O)c2cc3sccc3n2C)c1COc1ccc(OC[C@@H]2CCNC2)cc1
InChI Key: InChIKey=SQSNNQXVJVEDMY-HXUWFJFHSA-N
Data: 4 IC50
PDB links: 1 PDB ID matches this monomer.
Activity Spreadsheet -- Enzyme Inhibition Constant Data from BindingDB
Found 4 hits for monomerid = 50236444
Trg + Lig
Ki
nM
ΔG°
kcal/mole
IC50
nM
Kd
nM
EC50/IC50
nM
koff
s-1
kon
M-1s-1
pHTemp
°C
Amine oxidase (flavin-containing) A
(Homo sapiens (Human))
BDBM50236444
(CHEMBL4090812)
Show SMILES CCOCc1cccc(NC(=O)c2cc3sccc3n2C)c1COc1ccc(OC[C@@H]2CCNC2)cc1 |r|
Show InChI InChI=1S/C29H33N3O4S/c1-3-34-18-21-5-4-6-25(31-29(33)27-15-28-26(32(27)2)12-14-37-28)24(21)19-36-23-9-7-22(8-10-23)35-17-20-11-13-30-16-20/h4-10,12,14-15,20,30H,3,11,13,16-19H2,1-2H3,(H,31,33)/t20-/m1/s1
n/an/a 4.13E+4n/an/an/an/an/an/a
European Institute of Oncology
Curated by ChEMBL
Assay Description
Inhibition of [3H]dopamine uptake at striatal nerve endings by dopamine transporter
J Med Chem 60: 1693-1715 (2017)
Article DOI: 10.1021/acs.jmedchem.6b01019
BindingDB Entry DOI: 10.7270/Q22809VX
LSD1/CoREST complex
(Homo sapiens (Human))
BDBM50236444
(CHEMBL4090812)
Show SMILES CCOCc1cccc(NC(=O)c2cc3sccc3n2C)c1COc1ccc(OC[C@@H]2CCNC2)cc1 |r|
Show InChI InChI=1S/C29H33N3O4S/c1-3-34-18-21-5-4-6-25(31-29(33)27-15-28-26(32(27)2)12-14-37-28)24(21)19-36-23-9-7-22(8-10-23)35-17-20-11-13-30-16-20/h4-10,12,14-15,20,30H,3,11,13,16-19H2,1-2H3,(H,31,33)/t20-/m1/s1
n/an/a 7.80n/an/an/an/an/an/a
European Institute of Oncology
Curated by ChEMBL
Assay Description
Inhibition of recombinant human KDM1A/CoREST complex expressed in Escherichia coli using [Lys(Me1)4]-Histone H3 (1 to 21 residues)-GGK(biotin) as sub...
J Med Chem 60: 1693-1715 (2017)
Article DOI: 10.1021/acs.jmedchem.6b01019
BindingDB Entry DOI: 10.7270/Q22809VX
3D
3D Structure (crystal)
Lysine-specific histone demethylase 1B
(Homo sapiens (Human))
BDBM50236444
(CHEMBL4090812)
Show SMILES CCOCc1cccc(NC(=O)c2cc3sccc3n2C)c1COc1ccc(OC[C@@H]2CCNC2)cc1 |r|
Show InChI InChI=1S/C29H33N3O4S/c1-3-34-18-21-5-4-6-25(31-29(33)27-15-28-26(32(27)2)12-14-37-28)24(21)19-36-23-9-7-22(8-10-23)35-17-20-11-13-30-16-20/h4-10,12,14-15,20,30H,3,11,13,16-19H2,1-2H3,(H,31,33)/t20-/m1/s1
Reactome pathway
n/an/a 1.29E+4n/an/an/an/an/an/a
European Institute of Oncology
Curated by ChEMBL
Assay Description
Inhibition of [3H]dopamine uptake at striatal nerve endings by dopamine transporter
J Med Chem 60: 1693-1715 (2017)
Article DOI: 10.1021/acs.jmedchem.6b01019
BindingDB Entry DOI: 10.7270/Q22809VX
Amine oxidase [flavin-containing] B
(Homo sapiens (Human))
BDBM50236444
(CHEMBL4090812)
Show SMILES CCOCc1cccc(NC(=O)c2cc3sccc3n2C)c1COc1ccc(OC[C@@H]2CCNC2)cc1 |r|
Show InChI InChI=1S/C29H33N3O4S/c1-3-34-18-21-5-4-6-25(31-29(33)27-15-28-26(32(27)2)12-14-37-28)24(21)19-36-23-9-7-22(8-10-23)35-17-20-11-13-30-16-20/h4-10,12,14-15,20,30H,3,11,13,16-19H2,1-2H3,(H,31,33)/t20-/m1/s1
n/an/a>1.00E+5n/an/an/an/an/an/a
European Institute of Oncology
Curated by ChEMBL
Assay Description
Inhibition of [3H]dopamine uptake at striatal nerve endings by dopamine transporter
J Med Chem 60: 1693-1715 (2017)
Article DOI: 10.1021/acs.jmedchem.6b01019
BindingDB Entry DOI: 10.7270/Q22809VX