BDBM50236516 CHEMBL3731789
SMILES: CN(Cc1ccc2nccnc2c1)C(=O)c1ccc(cc1)N(Cc1ccccc1)C(=O)c1ccc(O)cc1O
InChI Key: InChIKey=ZFKNKAYLMPNXQG-UHFFFAOYSA-N
Data: 2 KI  2 IC50  1 Kd
PDB links: 1 PDB ID matches this monomer.
Activity Spreadsheet -- Enzyme Inhibition Constant Data from BindingDB
Found 5 hits for monomerid = 50236516
Trg + Lig
Ki
nM
ΔG°
kcal/mole
IC50
nM
Kd
nM
EC50/IC50
nM
koff
s-1
kon
M-1s-1
pHTemp
°C
[Pyruvate dehydrogenase (acetyl-transferring)] kinase isozyme 1, mitochondrial
(Homo sapiens (Human))
BDBM50236516
(CHEMBL3731789)
Show SMILES CN(Cc1ccc2nccnc2c1)C(=O)c1ccc(cc1)N(Cc1ccccc1)C(=O)c1ccc(O)cc1O
Show InChI InChI=1S/C31H26N4O4/c1-34(19-22-7-14-27-28(17-22)33-16-15-32-27)30(38)23-8-10-24(11-9-23)35(20-21-5-3-2-4-6-21)31(39)26-13-12-25(36)18-29(26)37/h2-18,36-37H,19-20H2,1H3
26n/an/an/an/an/an/an/an/a
Vernalis (R&D) Ltd.
Curated by ChEMBL
Assay Description
Inhibition of fluorescein-labelled VER160364 binding to PDHK1 (unknown origin) after 90 mins by fluorescence polarization assay
J Med Chem 60: 2271-2286 (2017)
Article DOI: 10.1021/acs.jmedchem.6b01478
BindingDB Entry DOI: 10.7270/Q2XG9TDJ
Heat shock protein HSP 90-alpha
(Homo sapiens (Human))
BDBM50236516
(CHEMBL3731789)
Show SMILES CN(Cc1ccc2nccnc2c1)C(=O)c1ccc(cc1)N(Cc1ccccc1)C(=O)c1ccc(O)cc1O
Show InChI InChI=1S/C31H26N4O4/c1-34(19-22-7-14-27-28(17-22)33-16-15-32-27)30(38)23-8-10-24(11-9-23)35(20-21-5-3-2-4-6-21)31(39)26-13-12-25(36)18-29(26)37/h2-18,36-37H,19-20H2,1H3
NCI pathway
Reactome pathway
1.02E+3n/an/an/an/an/an/an/an/a
Vernalis (R&D) Ltd.
Curated by ChEMBL
Assay Description
Displacement of fluorescein-labelled VER160364 from HSP90A (unknown origin) after 90 mins by fluorescence polarization assay
J Med Chem 60: 2271-2286 (2017)
Article DOI: 10.1021/acs.jmedchem.6b01478
BindingDB Entry DOI: 10.7270/Q2XG9TDJ
[Pyruvate dehydrogenase (acetyl-transferring)] kinase isozyme 1, mitochondrial
(Homo sapiens (Human))
BDBM50236516
(CHEMBL3731789)
Show SMILES CN(Cc1ccc2nccnc2c1)C(=O)c1ccc(cc1)N(Cc1ccccc1)C(=O)c1ccc(O)cc1O
Show InChI InChI=1S/C31H26N4O4/c1-34(19-22-7-14-27-28(17-22)33-16-15-32-27)30(38)23-8-10-24(11-9-23)35(20-21-5-3-2-4-6-21)31(39)26-13-12-25(36)18-29(26)37/h2-18,36-37H,19-20H2,1H3
n/an/a 63n/an/an/an/an/an/a
Vernalis (R&D) Ltd.
Curated by ChEMBL
Assay Description
Inhibition of PDHK1 (unknown origin) assessed as decrease in phosphorylation of E1alpha subunit at serine 293 residue after 1 hr by DELFIA
J Med Chem 60: 2271-2286 (2017)
Article DOI: 10.1021/acs.jmedchem.6b01478
BindingDB Entry DOI: 10.7270/Q2XG9TDJ
[Pyruvate dehydrogenase (acetyl-transferring)] kinase isozyme 1, mitochondrial
(Homo sapiens (Human))
BDBM50236516
(CHEMBL3731789)
Show SMILES CN(Cc1ccc2nccnc2c1)C(=O)c1ccc(cc1)N(Cc1ccccc1)C(=O)c1ccc(O)cc1O
Show InChI InChI=1S/C31H26N4O4/c1-34(19-22-7-14-27-28(17-22)33-16-15-32-27)30(38)23-8-10-24(11-9-23)35(20-21-5-3-2-4-6-21)31(39)26-13-12-25(36)18-29(26)37/h2-18,36-37H,19-20H2,1H3
n/an/an/a 1n/an/an/an/an/a
Vernalis (R&D) Ltd.
Curated by ChEMBL
Assay Description
Binding affinity to PDHK1 (unknown origin) by surface plasmon resonance method
J Med Chem 60: 2271-2286 (2017)
Article DOI: 10.1021/acs.jmedchem.6b01478
BindingDB Entry DOI: 10.7270/Q2XG9TDJ
[Pyruvate dehydrogenase (acetyl-transferring)] kinase isozyme 1, mitochondrial
(Homo sapiens (Human))
BDBM50236516
(CHEMBL3731789)
Show SMILES CN(Cc1ccc2nccnc2c1)C(=O)c1ccc(cc1)N(Cc1ccccc1)C(=O)c1ccc(O)cc1O
Show InChI InChI=1S/C31H26N4O4/c1-34(19-22-7-14-27-28(17-22)33-16-15-32-27)30(38)23-8-10-24(11-9-23)35(20-21-5-3-2-4-6-21)31(39)26-13-12-25(36)18-29(26)37/h2-18,36-37H,19-20H2,1H3
n/an/a 5.65E+3n/an/an/an/an/an/a
Vernalis (R&D) Ltd.
Curated by ChEMBL
Assay Description
Binding affinity towards human Dopamine receptor D2 (long) by [3H]-spiperone displacement.
J Med Chem 60: 2271-2286 (2017)
Article DOI: 10.1021/acs.jmedchem.6b01478
BindingDB Entry DOI: 10.7270/Q2XG9TDJ