BDBM50236720 CHEMBL4104749
SMILES: CN[C@@H](C)Cc1ccc(OC)cc1
InChI Key: InChIKey=UGFMBZYKVQSQFX-VIFPVBQESA-N
Data: 2 EC50
Activity Spreadsheet -- Enzyme Inhibition Constant Data from BindingDB
Found 2 hits for monomerid = 50236720
Trg + Lig
Ki
nM
ΔG°
kcal/mole
IC50
nM
Kd
nM
EC50/IC50
nM
koff
s-1
kon
M-1s-1
pHTemp
°C
Sodium-dependent dopamine transporter
(Rattus norvegicus (rat))
BDBM50236720
(CHEMBL4104749)
Show SMILES CN[C@@H](C)Cc1ccc(OC)cc1 |r|
Show InChI InChI=1S/C11H17NO/c1-9(12-2)8-10-4-6-11(13-3)7-5-10/h4-7,9,12H,8H2,1-3H3/t9-/m0/s1
Reactome pathway
n/an/an/an/a 1.00E+3n/an/an/an/a
Virginia Commonwealth University
Curated by ChEMBL
Assay Description
Activity at DAT in rat synaptosomes assessed as release of [3H]DA after 5 mins by liquid scintillation counting method
J Med Chem 60: 2605-2628 (2017)
Article DOI: 10.1021/acs.jmedchem.7b00085
BindingDB Entry DOI: 10.7270/Q2DJ5HWM
Sodium-dependent serotonin transporter
(Rattus norvegicus (rat))
BDBM50236720
(CHEMBL4104749)
Show SMILES CN[C@@H](C)Cc1ccc(OC)cc1 |r|
Show InChI InChI=1S/C11H17NO/c1-9(12-2)8-10-4-6-11(13-3)7-5-10/h4-7,9,12H,8H2,1-3H3/t9-/m0/s1
n/an/an/an/a 41n/an/an/an/a
Virginia Commonwealth University
Curated by ChEMBL
Assay Description
Antagonist activity against human progesterone receptor (hPR) using cotransfection assay in CV-1 cells
J Med Chem 60: 2605-2628 (2017)
Article DOI: 10.1021/acs.jmedchem.7b00085
BindingDB Entry DOI: 10.7270/Q2DJ5HWM