null
SMILES: COc1ccccc1N1CCN(CCCCOc2ccc3ccnn3c2)CC1
InChI Key: InChIKey=VIESVSSRMWPJQT-UHFFFAOYSA-N
Activity Spreadsheet -- Enzyme Inhibition Constant Data from BindingDB
Found 15 hits for monomerid = 50236737
Trg + Lig
Ki
nM
ΔG°
kcal/mole
IC50
nM
Kd
nM
EC50/IC50
nM
koff
s-1
kon
M-1s-1
pHTemp
°C
D(4) dopamine receptor
(Homo sapiens (Human))
BDBM50236737
(CHEMBL4098803)
Show SMILES COc1ccccc1N1CCN(CCCCOc2ccc3ccnn3c2)CC1
Show InChI InChI=1S/C22H28N4O2/c1-27-22-7-3-2-6-21(22)25-15-13-24(14-16-25)12-4-5-17-28-20-9-8-19-10-11-23-26(19)18-20/h2-3,6-11,18H,4-5,12-17H2,1H3
Reactome pathway
0.690n/an/an/an/an/an/an/an/a
Friedrich-Alexander University Erlangen-N£rnberg
Curated by ChEMBL
Assay Description
Displacement of [3H]spiperone from human Dopamine D4 receptor expressed in CHO cell membranes after 2 hrs by scintillation counting analysis
J Med Chem 60: 2908-2929 (2017)
Article DOI: 10.1021/acs.jmedchem.6b01857
BindingDB Entry DOI: 10.7270/Q2CJ8GR7
D(2) dopamine receptor
(Homo sapiens (Human))
BDBM50236737
(CHEMBL4098803)
Show SMILES COc1ccccc1N1CCN(CCCCOc2ccc3ccnn3c2)CC1
Show InChI InChI=1S/C22H28N4O2/c1-27-22-7-3-2-6-21(22)25-15-13-24(14-16-25)12-4-5-17-28-20-9-8-19-10-11-23-26(19)18-20/h2-3,6-11,18H,4-5,12-17H2,1H3
Reactome pathway
0.740n/an/an/an/an/an/an/an/a
Friedrich-Alexander University Erlangen-N£rnberg
Curated by ChEMBL
Assay Description
Displacement of [3H]spiperone from human Dopamine D2S receptor expressed in CHO cell membranes after 2 hrs by scintillation counting analysis
J Med Chem 60: 2908-2929 (2017)
Article DOI: 10.1021/acs.jmedchem.6b01857
BindingDB Entry DOI: 10.7270/Q2CJ8GR7
D(2) dopamine receptor
(Homo sapiens (Human))
BDBM50236737
(CHEMBL4098803)
Show SMILES COc1ccccc1N1CCN(CCCCOc2ccc3ccnn3c2)CC1
Show InChI InChI=1S/C22H28N4O2/c1-27-22-7-3-2-6-21(22)25-15-13-24(14-16-25)12-4-5-17-28-20-9-8-19-10-11-23-26(19)18-20/h2-3,6-11,18H,4-5,12-17H2,1H3
Reactome pathway
1.80n/an/an/an/an/an/an/an/a
Friedrich-Alexander University Erlangen-N£rnberg
Curated by ChEMBL
Assay Description
Displacement of [3H]spiperone from human Dopamine D2L receptor expressed in CHO cell membranes after 2 hrs by scintillation counting analysis
J Med Chem 60: 2908-2929 (2017)
Article DOI: 10.1021/acs.jmedchem.6b01857
BindingDB Entry DOI: 10.7270/Q2CJ8GR7
D(3) dopamine receptor
(Homo sapiens (Human))
BDBM50236737
(CHEMBL4098803)
Show SMILES COc1ccccc1N1CCN(CCCCOc2ccc3ccnn3c2)CC1
Show InChI InChI=1S/C22H28N4O2/c1-27-22-7-3-2-6-21(22)25-15-13-24(14-16-25)12-4-5-17-28-20-9-8-19-10-11-23-26(19)18-20/h2-3,6-11,18H,4-5,12-17H2,1H3
5n/an/an/an/an/an/an/an/a
Friedrich-Alexander University Erlangen-N£rnberg
Curated by ChEMBL
Assay Description
Displacement of [3H]spiperone from human Dopamine D3 receptor expressed in CHO cell membranes after 2 hrs by scintillation counting analysis
J Med Chem 60: 2908-2929 (2017)
Article DOI: 10.1021/acs.jmedchem.6b01857
BindingDB Entry DOI: 10.7270/Q2CJ8GR7
5-hydroxytryptamine receptor 2A
(Homo sapiens (Human))
BDBM50236737
(CHEMBL4098803)
Show SMILES COc1ccccc1N1CCN(CCCCOc2ccc3ccnn3c2)CC1
Show InChI InChI=1S/C22H28N4O2/c1-27-22-7-3-2-6-21(22)25-15-13-24(14-16-25)12-4-5-17-28-20-9-8-19-10-11-23-26(19)18-20/h2-3,6-11,18H,4-5,12-17H2,1H3
Reactome pathway
210n/an/an/an/an/an/an/an/a
Friedrich-Alexander University Erlangen-N£rnberg
Curated by ChEMBL
Assay Description
Displacement of [3H]ketanserin from human 5-HT2A receptor expressed in HEK293T cell membranes after 2 hrs by scintillation counting analysis
J Med Chem 60: 2908-2929 (2017)
Article DOI: 10.1021/acs.jmedchem.6b01857
BindingDB Entry DOI: 10.7270/Q2CJ8GR7
D(1A) dopamine receptor
(Homo sapiens (Human))
BDBM50236737
(CHEMBL4098803)
Show SMILES COc1ccccc1N1CCN(CCCCOc2ccc3ccnn3c2)CC1
Show InChI InChI=1S/C22H28N4O2/c1-27-22-7-3-2-6-21(22)25-15-13-24(14-16-25)12-4-5-17-28-20-9-8-19-10-11-23-26(19)18-20/h2-3,6-11,18H,4-5,12-17H2,1H3
1.10E+3n/an/an/an/an/an/an/an/a
Friedrich-Alexander University Erlangen-N£rnberg
Curated by ChEMBL
Assay Description
Displacement of [3H]SCH23390 from human Dopamine D1 receptor expressed in HEK293T cell membranes after 2 hrs by scintillation counting analysis
J Med Chem 60: 2908-2929 (2017)
Article DOI: 10.1021/acs.jmedchem.6b01857
BindingDB Entry DOI: 10.7270/Q2CJ8GR7
D(2) dopamine receptor
(Homo sapiens (Human))
BDBM50236737
(CHEMBL4098803)
Show SMILES COc1ccccc1N1CCN(CCCCOc2ccc3ccnn3c2)CC1
Show InChI InChI=1S/C22H28N4O2/c1-27-22-7-3-2-6-21(22)25-15-13-24(14-16-25)12-4-5-17-28-20-9-8-19-10-11-23-26(19)18-20/h2-3,6-11,18H,4-5,12-17H2,1H3
Reactome pathway
n/an/an/an/a 4.10n/an/an/an/a
Friedrich-Alexander University Erlangen-N£rnberg
Curated by ChEMBL
Assay Description
Agonist activity at human Dopamine D2S receptor expressed in HEK293T cell membranes coexpressing GalphaoA incubated for 30 mins measured after 75 min...
J Med Chem 60: 2908-2929 (2017)
Article DOI: 10.1021/acs.jmedchem.6b01857
BindingDB Entry DOI: 10.7270/Q2CJ8GR7
D(2) dopamine receptor
(Homo sapiens (Human))
BDBM50236737
(CHEMBL4098803)
Show SMILES COc1ccccc1N1CCN(CCCCOc2ccc3ccnn3c2)CC1
Show InChI InChI=1S/C22H28N4O2/c1-27-22-7-3-2-6-21(22)25-15-13-24(14-16-25)12-4-5-17-28-20-9-8-19-10-11-23-26(19)18-20/h2-3,6-11,18H,4-5,12-17H2,1H3
Reactome pathway
n/an/an/an/a 5n/an/an/an/a
Friedrich-Alexander University Erlangen-N£rnberg
Curated by ChEMBL
Assay Description
Agonist activity at N-terminal flag-tagged D2S receptor (unknown origin) expressed in HEK293 cells coexpressing renilla luciferase 2-tagged Galphai3 ...
J Med Chem 60: 2908-2929 (2017)
Article DOI: 10.1021/acs.jmedchem.6b01857
BindingDB Entry DOI: 10.7270/Q2CJ8GR7
D(2) dopamine receptor
(Homo sapiens (Human))
BDBM50236737
(CHEMBL4098803)
Show SMILES COc1ccccc1N1CCN(CCCCOc2ccc3ccnn3c2)CC1
Show InChI InChI=1S/C22H28N4O2/c1-27-22-7-3-2-6-21(22)25-15-13-24(14-16-25)12-4-5-17-28-20-9-8-19-10-11-23-26(19)18-20/h2-3,6-11,18H,4-5,12-17H2,1H3
Reactome pathway
n/an/an/an/a 2.10n/an/an/an/a
Friedrich-Alexander University Erlangen-N£rnberg
Curated by ChEMBL
Assay Description
Agonist activity at N-terminal flag-tagged D2S receptor (unknown origin) expressed in HEK293 cells coexpressing renilla luciferase 2-tagged Galphai1 ...
J Med Chem 60: 2908-2929 (2017)
Article DOI: 10.1021/acs.jmedchem.6b01857
BindingDB Entry DOI: 10.7270/Q2CJ8GR7
D(2) dopamine receptor
(Homo sapiens (Human))
BDBM50236737
(CHEMBL4098803)
Show SMILES COc1ccccc1N1CCN(CCCCOc2ccc3ccnn3c2)CC1
Show InChI InChI=1S/C22H28N4O2/c1-27-22-7-3-2-6-21(22)25-15-13-24(14-16-25)12-4-5-17-28-20-9-8-19-10-11-23-26(19)18-20/h2-3,6-11,18H,4-5,12-17H2,1H3
Reactome pathway
n/an/an/an/a 23n/an/an/an/a
Friedrich-Alexander University Erlangen-N£rnberg
Curated by ChEMBL
Assay Description
Agonist activity at human Dopamine D2S receptor expressed in HEK293T cell membranes coexpressing Galphai2 incubated for 30 mins measured after 75 min...
J Med Chem 60: 2908-2929 (2017)
Article DOI: 10.1021/acs.jmedchem.6b01857
BindingDB Entry DOI: 10.7270/Q2CJ8GR7
D(3) dopamine receptor
(Homo sapiens (Human))
BDBM50236737
(CHEMBL4098803)
Show SMILES COc1ccccc1N1CCN(CCCCOc2ccc3ccnn3c2)CC1
Show InChI InChI=1S/C22H28N4O2/c1-27-22-7-3-2-6-21(22)25-15-13-24(14-16-25)12-4-5-17-28-20-9-8-19-10-11-23-26(19)18-20/h2-3,6-11,18H,4-5,12-17H2,1H3
n/an/an/an/a 29n/an/an/an/a
Friedrich-Alexander University Erlangen-N£rnberg
Curated by ChEMBL
Assay Description
Functional cocaine antagonism was evaluated by inhibition of [3H]dopamine reuptake
J Med Chem 60: 2908-2929 (2017)
Article DOI: 10.1021/acs.jmedchem.6b01857
BindingDB Entry DOI: 10.7270/Q2CJ8GR7
D(3) dopamine receptor
(Homo sapiens (Human))
BDBM50236737
(CHEMBL4098803)
Show SMILES COc1ccccc1N1CCN(CCCCOc2ccc3ccnn3c2)CC1
Show InChI InChI=1S/C22H28N4O2/c1-27-22-7-3-2-6-21(22)25-15-13-24(14-16-25)12-4-5-17-28-20-9-8-19-10-11-23-26(19)18-20/h2-3,6-11,18H,4-5,12-17H2,1H3
n/an/an/an/a 29n/an/an/an/a
Friedrich-Alexander University Erlangen-N£rnberg
Curated by ChEMBL
Assay Description
Agonist activity at human Dopamine D3 receptor expressed in HEK293T cell membranes coexpressing GalphaoA incubated for 30 mins measured after 75 mins...
J Med Chem 60: 2908-2929 (2017)
Article DOI: 10.1021/acs.jmedchem.6b01857
BindingDB Entry DOI: 10.7270/Q2CJ8GR7
D(2) dopamine receptor
(Homo sapiens (Human))
BDBM50236737
(CHEMBL4098803)
Show SMILES COc1ccccc1N1CCN(CCCCOc2ccc3ccnn3c2)CC1
Show InChI InChI=1S/C22H28N4O2/c1-27-22-7-3-2-6-21(22)25-15-13-24(14-16-25)12-4-5-17-28-20-9-8-19-10-11-23-26(19)18-20/h2-3,6-11,18H,4-5,12-17H2,1H3
Reactome pathway
n/an/an/an/a 4.40n/an/an/an/a
Friedrich-Alexander University Erlangen-N£rnberg
Curated by ChEMBL
Assay Description
Concentration required for the inhibitory activity against human Farnesyltransferase
J Med Chem 60: 2908-2929 (2017)
Article DOI: 10.1021/acs.jmedchem.6b01857
BindingDB Entry DOI: 10.7270/Q2CJ8GR7
D(2) dopamine receptor
(Homo sapiens (Human))
BDBM50236737
(CHEMBL4098803)
Show SMILES COc1ccccc1N1CCN(CCCCOc2ccc3ccnn3c2)CC1
Show InChI InChI=1S/C22H28N4O2/c1-27-22-7-3-2-6-21(22)25-15-13-24(14-16-25)12-4-5-17-28-20-9-8-19-10-11-23-26(19)18-20/h2-3,6-11,18H,4-5,12-17H2,1H3
Reactome pathway
n/an/an/an/a 1.90n/an/an/an/a
Friedrich-Alexander University Erlangen-N£rnberg
Curated by ChEMBL
Assay Description
In vitro binding affinity against Tachykinin receptor 1 in rabbit whole brain membranes using [3H][Sar9Met(O2)]-SP binding assay
J Med Chem 60: 2908-2929 (2017)
Article DOI: 10.1021/acs.jmedchem.6b01857
BindingDB Entry DOI: 10.7270/Q2CJ8GR7
D(2) dopamine receptor
(Homo sapiens (Human))
BDBM50236737
(CHEMBL4098803)
Show SMILES COc1ccccc1N1CCN(CCCCOc2ccc3ccnn3c2)CC1
Show InChI InChI=1S/C22H28N4O2/c1-27-22-7-3-2-6-21(22)25-15-13-24(14-16-25)12-4-5-17-28-20-9-8-19-10-11-23-26(19)18-20/h2-3,6-11,18H,4-5,12-17H2,1H3
Reactome pathway
n/an/an/an/a 1.5n/an/an/an/a
Friedrich-Alexander University Erlangen-N£rnberg
Curated by ChEMBL
Assay Description
In vitro binding affinity against Tachykinin receptor 1 in rabbit whole brain membranes using [3H][Sar9Met(O2)]-SP binding assay
J Med Chem 60: 2908-2929 (2017)
Article DOI: 10.1021/acs.jmedchem.6b01857
BindingDB Entry DOI: 10.7270/Q2CJ8GR7