BDBM50236901 CHEMBL4061563
SMILES: COC(=O)C(C)Oc1ccc2c(C)cc(=O)oc2c1
InChI Key: InChIKey=NPTOZJLCWXEGKK-UHFFFAOYSA-N
Data: 1 KI  1 IC50
Activity Spreadsheet -- Enzyme Inhibition Constant Data from BindingDB
Found 2 hits for monomerid = 50236901
Trg + Lig
Ki
nM
ΔG°
kcal/mole
IC50
nM
Kd
nM
EC50/IC50
nM
koff
s-1
kon
M-1s-1
pHTemp
°C
Aldehyde dehydrogenase, mitochondrial
(Homo sapiens (Human))
BDBM50236901
(CHEMBL4061563)
Show SMILES COC(=O)C(C)Oc1ccc2c(C)cc(=O)oc2c1
Show InChI InChI=1S/C14H14O5/c1-8-6-13(15)19-12-7-10(4-5-11(8)12)18-9(2)14(16)17-3/h4-7,9H,1-3H3
Reactome pathway
310n/an/an/an/an/an/an/an/a
Indiana University School of Medicine
Curated by ChEMBL
Assay Description
Displacement of [3H]spiperone from human Dopamine receptor D3 expressed in CHO cells
J Med Chem 60: 2439-2455 (2017)
Article DOI: 10.1021/acs.jmedchem.6b01825
BindingDB Entry DOI: 10.7270/Q2M32Z11
Aldehyde dehydrogenase, mitochondrial
(Homo sapiens (Human))
BDBM50236901
(CHEMBL4061563)
Show SMILES COC(=O)C(C)Oc1ccc2c(C)cc(=O)oc2c1
Show InChI InChI=1S/C14H14O5/c1-8-6-13(15)19-12-7-10(4-5-11(8)12)18-9(2)14(16)17-3/h4-7,9H,1-3H3
Reactome pathway
n/an/a 1.50E+3n/an/an/an/an/an/a
Indiana University School of Medicine
Curated by ChEMBL
Assay Description
Inhibition of full length recombinant human ALDH2 expressed in Escherichia coli assessed as reduction in dehydrogenase activity by measuring NAD(P)H ...
J Med Chem 60: 2439-2455 (2017)
Article DOI: 10.1021/acs.jmedchem.6b01825
BindingDB Entry DOI: 10.7270/Q2M32Z11