BDBM50237521 CHEMBL4101437
SMILES: N[C@H]1CC[C@@](CCNc2cc(F)c(cc2Cl)S(=O)(=O)Nc2nccs2)(CC1)c1ccccc1
InChI Key: InChIKey=ANLVMSBBWJNZSY-QBNMFFNISA-N
Data: 3 IC50
Activity Spreadsheet -- Enzyme Inhibition Constant Data from BindingDB
Found 3 hits for monomerid = 50237521
Trg + Lig
Ki
nM
ΔG°
kcal/mole
IC50
nM
Kd
nM
EC50/IC50
nM
koff
s-1
kon
M-1s-1
pHTemp
°C
Cytochrome P450 3A4
(Homo sapiens (Human))
BDBM50237521
(CHEMBL4101437)
Show SMILES N[C@H]1CC[C@@](CCNc2cc(F)c(cc2Cl)S(=O)(=O)Nc2nccs2)(CC1)c1ccccc1 |r,wU:4.4,1.0,(22.89,-44.29,;22.94,-42.75,;21.64,-41.94,;21.69,-40.41,;23.04,-39.69,;23.82,-38.36,;25.35,-38.37,;26.12,-39.7,;27.66,-39.71,;28.42,-38.39,;29.95,-38.39,;30.73,-37.06,;30.73,-39.73,;29.95,-41.06,;28.41,-41.06,;27.63,-42.38,;32.26,-39.74,;32.68,-38.25,;33.76,-39.35,;33.03,-41.08,;34.57,-41.08,;35.48,-39.84,;36.94,-40.32,;36.93,-41.86,;35.47,-42.33,;24.36,-40.48,;24.3,-42.03,;21.94,-38.59,;22.35,-37.08,;21.25,-35.98,;19.75,-36.38,;19.34,-37.89,;20.44,-38.99,)|
Show InChI InChI=1S/C23H26ClFN4O2S2/c24-18-14-21(33(30,31)29-22-28-12-13-32-22)19(25)15-20(18)27-11-10-23(8-6-17(26)7-9-23)16-4-2-1-3-5-16/h1-5,12-15,17,27H,6-11,26H2,(H,28,29)/t17-,23-
Reactome pathway
n/an/a 6.70E+3n/an/an/an/an/an/a
Bristol-Myers Squibb
Curated by ChEMBL
Assay Description
Inhibition of human CYP3A4 assessed as inhibition of dealkylation
J Med Chem 60: 2513-2525 (2017)
Article DOI: 10.1021/acs.jmedchem.6b01918
BindingDB Entry DOI: 10.7270/Q2057J69
Sodium channel protein type 9 subunit alpha
(Homo sapiens (Human))
BDBM50237521
(CHEMBL4101437)
Show SMILES N[C@H]1CC[C@@](CCNc2cc(F)c(cc2Cl)S(=O)(=O)Nc2nccs2)(CC1)c1ccccc1 |r,wU:4.4,1.0,(22.89,-44.29,;22.94,-42.75,;21.64,-41.94,;21.69,-40.41,;23.04,-39.69,;23.82,-38.36,;25.35,-38.37,;26.12,-39.7,;27.66,-39.71,;28.42,-38.39,;29.95,-38.39,;30.73,-37.06,;30.73,-39.73,;29.95,-41.06,;28.41,-41.06,;27.63,-42.38,;32.26,-39.74,;32.68,-38.25,;33.76,-39.35,;33.03,-41.08,;34.57,-41.08,;35.48,-39.84,;36.94,-40.32,;36.93,-41.86,;35.47,-42.33,;24.36,-40.48,;24.3,-42.03,;21.94,-38.59,;22.35,-37.08,;21.25,-35.98,;19.75,-36.38,;19.34,-37.89,;20.44,-38.99,)|
Show InChI InChI=1S/C23H26ClFN4O2S2/c24-18-14-21(33(30,31)29-22-28-12-13-32-22)19(25)15-20(18)27-11-10-23(8-6-17(26)7-9-23)16-4-2-1-3-5-16/h1-5,12-15,17,27H,6-11,26H2,(H,28,29)/t17-,23-
n/an/a 9n/an/an/an/an/an/a
Bristol-Myers Squibb
Curated by ChEMBL
Assay Description
Inhibition of recombinant human Nav1.7 expressed in HEK293 cells assessed as reduction in peak inward current at -60 mV holding potential measured af...
J Med Chem 60: 2513-2525 (2017)
Article DOI: 10.1021/acs.jmedchem.6b01918
BindingDB Entry DOI: 10.7270/Q2057J69
Sodium channel protein type 5 subunit alpha
(Homo sapiens (Human))
BDBM50237521
(CHEMBL4101437)
Show SMILES N[C@H]1CC[C@@](CCNc2cc(F)c(cc2Cl)S(=O)(=O)Nc2nccs2)(CC1)c1ccccc1 |r,wU:4.4,1.0,(22.89,-44.29,;22.94,-42.75,;21.64,-41.94,;21.69,-40.41,;23.04,-39.69,;23.82,-38.36,;25.35,-38.37,;26.12,-39.7,;27.66,-39.71,;28.42,-38.39,;29.95,-38.39,;30.73,-37.06,;30.73,-39.73,;29.95,-41.06,;28.41,-41.06,;27.63,-42.38,;32.26,-39.74,;32.68,-38.25,;33.76,-39.35,;33.03,-41.08,;34.57,-41.08,;35.48,-39.84,;36.94,-40.32,;36.93,-41.86,;35.47,-42.33,;24.36,-40.48,;24.3,-42.03,;21.94,-38.59,;22.35,-37.08,;21.25,-35.98,;19.75,-36.38,;19.34,-37.89,;20.44,-38.99,)|
Show InChI InChI=1S/C23H26ClFN4O2S2/c24-18-14-21(33(30,31)29-22-28-12-13-32-22)19(25)15-20(18)27-11-10-23(8-6-17(26)7-9-23)16-4-2-1-3-5-16/h1-5,12-15,17,27H,6-11,26H2,(H,28,29)/t17-,23-
n/an/a>3.00E+4n/an/an/an/an/an/a
Bristol-Myers Squibb
Curated by ChEMBL
Assay Description
Inhibition of recombinant human Nav1.5 expressed in HEK293 cells assessed as reduction in peak inward current at -50 mV holding potential measured af...
J Med Chem 60: 2513-2525 (2017)
Article DOI: 10.1021/acs.jmedchem.6b01918
BindingDB Entry DOI: 10.7270/Q2057J69