BDBM50237693 CHEMBL4083382
SMILES: COC(=O)C1=C(Nc2ccccn2)O\C(=C/c2c[nH]c3ncccc23)C1=O
InChI Key: InChIKey=AHTKZCGGZBVTQN-LCYFTJDESA-N
Data: 1 IC50
Activity Spreadsheet -- Enzyme Inhibition Constant Data from BindingDB
Found 1 hit for monomerid = 50237693
Trg + Lig
Ki
nM
ΔG°
kcal/mole
IC50
nM
Kd
nM
EC50/IC50
nM
koff
s-1
kon
M-1s-1
pHTemp
°C
CDC7 and DBF4
(Homo sapiens (Human))
BDBM50237693
(CHEMBL4083382)
Show SMILES COC(=O)C1=C(Nc2ccccn2)O\C(=C/c2c[nH]c3ncccc23)C1=O |c:4|
Show InChI InChI=1S/C19H14N4O4/c1-26-19(25)15-16(24)13(27-18(15)23-14-6-2-3-7-20-14)9-11-10-22-17-12(11)5-4-8-21-17/h2-10H,1H3,(H,20,23)(H,21,22)/b13-9-
n/an/a 30n/an/an/an/an/an/a
Carna Biosciences, Inc.
Curated by ChEMBL
Assay Description
Inhibition of recombinant human Cdc7 (1 to 574 residues)/human N-terminal GST-tagged ASK (1 to 674 residues) expressed in baculovirus expression syst...
Eur J Med Chem 130: 406-418 (2017)
Article DOI: 10.1016/j.ejmech.2017.02.030
BindingDB Entry DOI: 10.7270/Q2X63Q71